{"text_format":"1","workbook":"xlsx","n_sheets":13,"sheets":["All Bridges","BCA Summary","Benefits Summary (by Tfc Grp)","Cost Summary (by Brdg)","Traffic Group Benefits","Individual Bridge Costs","TDC","Traffic Groups","Fixed Factors","Bridge List","Capital Costs","O&M Costs","Shipper-Logistics Costs"],"not_rendered":{"charts":0,"images":0,"macros":1,"external_links":2,"defined_names":89,"comments":0,"pivot_tables":0},"unopened":[],"bounds":{"document_bytes":16777216,"sheet_cells":100000,"rows_first":2000,"rows_last":500,"rows_between":2000,"halvings":0,"cell_chars":16384,"cell_head_chars":4096},"cells_cut":0,"cells_raw":0,"read":"whole","date_system":"1900"}

{"sheet":"All Bridges","index":0,"n_rows":39,"n_cols":15,"rows_kept":39,"cut":false,"hidden":false,"merged":[[31,0,31,7]]}
["Bridge ID","Discounted Benefits ($M)","Discounted Costs ($M)","Benefit/Cost Ratio","Vehicle Operating Costs ($M)","Personal & Crew Time ($M)","Logistics/ Freight Costs ($M)","Safety ($M)","Environmental ($M)","Capital Investment Costs ($M)","O&M Costs ($M)","Residual Value ($M)",null,null,"Click to button rerun all bridges benefits & costs:"]
[13079,{"$f":"SUM(E2:I2)","v":9.7641255671270226},{"$f":"SUM(J2:L2)","v":1.6070960833248948},{"$f":"B2/C2","v":6.0756327318813339},{"$f":"C$34/2+C$35/2+C$36/4+C$37/4+C$38/7","v":3.4271517141998999},{"$f":"D$34/2+D$35/2+D$36/4+D$37/4+D$38/7","v":3.03986524806494},{"$f":"E$34/2+E$35/2+E$36/4+E$37/4+E$38/7","v":0.88915949281731843},{"$f":"F$34/2+F$35/2+F$36/4+F$37/4+F$38/7","v":2.1399008979339844},{"$f":"G$34/2+G$35/2+G$36/4+G$37/4+G$38/7","v":0.26804821411088126},1.8209952330802306,-3.2642290319331677E-2,-0.181256859436004,null,null,"(i.e. if inputs changed in sensitivity tests)"]
[10053,{"$f":"SUM(E3:I3)","v":9.7641255671270226},{"$f":"SUM(J3:L3)","v":1.0909237730742518},{"$f":"B3/C3","v":8.9503279771889659},{"$f":"C$34/2+C$35/2+C$36/4+C$37/4+C$38/7","v":3.4271517141998999},{"$f":"D$34/2+D$35/2+D$36/4+D$37/4+D$38/7","v":3.03986524806494},0.88915949281731843,{"$f":"F$34/2+F$35/2+F$36/4+F$37/4+F$38/7","v":2.1399008979339844},0.26804821411088126,1.2496331703216783,-3.2642290319331677E-2,-0.12606710692809486]
[12934,8.6516310976273019,0.69642404918454703,12.422935577479873,{"$f":"C$36/4+C$37/4+C$38/7","v":3.0366725768749876},{"$f":"D$36/4+D$37/4+D$38/7","v":2.693512340859169},0.78785139190629128,1.8960871638865722,0.23750762410028237,0.81581698765253385,-3.2642290319331677E-2,-8.6750648148655157E-2]
[12980,8.6516310976273019,0.61242919502380533,14.126745047304627,{"$f":"C$36/4+C$37/4+C$38/7","v":3.0366725768749876},2.693512340859169,0.78785139190629128,1.8960871638865722,0.23750762410028237,0.64507148534313696,-3.2642290319331677E-2,0]
[13653,8.2112687034503278,1.8018532685512929,4.5571239605166438,{"$f":"C$38/7","v":2.8821079183505431},{"$f":"D$38/7","v":2.5564143150902177},0.74775026862900973,1.7995775608261382,0.22541864055442032,2.0611635763191951,-5.9285291043087468E-2,-0.20002501672481476]
[13925,8.2112687034503278,3.0210441748715331,2.7180233813692922,{"$f":"C$38/7","v":2.8821079183505431},2.5564143150902177,0.74775026862900973,1.7995775608261382,0.22541864055442032,3.4107118130181888,-5.9285291043087468E-2,-0.33038234710356823]
[13783,8.2112687034503278,0.73312848747287729,11.200313238072216,{"$f":"C$38/7","v":2.8821079183505431},2.5564143150902177,0.74775026862900973,1.7995775608261382,0.22541864055442032,0.76577077779220892,-3.2642290319331677E-2,0]
{"$rows_left_out":32}
{"sheet":"BCA Summary","index":1,"n_rows":21,"n_cols":3,"rows_kept":21,"cut":false,"hidden":false,"merged":[[1,0,1,1]]}
["Bridge ID:",13783,"Select individual bridge from dropdown"]
["Benefit Cost Summary"]
["Benefit","7% discount rate (in $M's)"]
["Vehicle Operating Costs",{"$f":"VLOOKUP($B$1,'All Bridges'!$A$2:$I$8,5,FALSE)","v":2.8821079183505431}]
["Value of Personal & Crew Time",{"$f":"VLOOKUP($B$1,'All Bridges'!$A$2:$I$8,6,FALSE)","v":2.5564143150902177}]
["Logistics/Freight Costs",{"$f":"VLOOKUP($B$1,'All Bridges'!$A$2:$I$8,7,FALSE)","v":0.74775026862900973}]
["Safety",{"$f":"VLOOKUP($B$1,'All Bridges'!$A$2:$I$8,8,FALSE)","v":1.7995775608261382}]
["Environmental: Non-CO2",{"$f":"VLOOKUP($B$1,'All Bridges'!$A$2:$I$8,9,FALSE)","v":0.22541864055442032}]
{"$rows_left_out":14}
{"sheet":"Benefits Summary (by Tfc Grp)","index":2,"n_rows":38,"n_cols":20,"rows_kept":38,"cut":false,"hidden":false,"merged":[[1,1,1,6],[1,9,1,15]]}
[null,"Traffic Group:",{"$f":"'Traffic Group Benefits'!D2","v":3},null,null,null,null,null,null,null,null,null,null,null,null,null,null,null,"Discount rate:",{"$f":"'Cost Summary (by Brdg)'!G1","v":7.0000000000000007E-2}]
[null,"Benefits Summary",null,null,null,null,null,null,null,"Benefits Discounted at 7% (in $millions)",null,null,null,null,null,null,2018]
[null,"Year","Vehicle Operating Costs","Value of Personal & Crew Time","Shipper/ Logistics Cost","Safety Cost","Environmental Cost","Total",null,"Year","Vehicle Operating Costs","Value of Personal & Crew Time","Shipper/ Logistics Cost","Safety Cost","Environmental Cost","Total Benefits","Discount Factor 7%"]
[null,2018,{"$f":"'Traffic Group Benefits'!N8+'Traffic Group Benefits'!O8","v":0},{"$f":"'Traffic Group Benefits'!P8+'Traffic Group Benefits'!Q8","v":0},{"$f":"'Traffic Group Benefits'!R8","v":0},{"$f":"'Traffic Group Benefits'!S8","v":0},{"$f":"'Traffic Group Benefits'!T8+'Traffic Group Benefits'!U8","v":0},{"$f":"SUM(C4:G4)","v":0},null,{"$f":"B4","v":2018},{"$f":"(C4/1000000)*$Q4","v":0},{"$f":"(D4/1000000)*$Q4","v":0},0,0,0,{"$f":"(H4/1000000)*$Q4","v":0},{"$f":"1/((1+$T$1)^(J4-$Q$2))","v":1}]
[null,2019,{"$f":"'Traffic Group Benefits'!N9+'Traffic Group Benefits'!O9","v":0},{"$f":"'Traffic Group Benefits'!P9+'Traffic Group Benefits'!Q9","v":0},{"$f":"'Traffic Group Benefits'!R9","v":0},{"$f":"'Traffic Group Benefits'!S9","v":0},{"$f":"'Traffic Group Benefits'!T9+'Traffic Group Benefits'!U9","v":0},{"$f":"SUM(C5:G5)","v":0},null,2019,{"$f":"(C5/1000000)*$Q5","v":0},{"$f":"(D5/1000000)*$Q5","v":0},{"$f":"(E5/1000000)*$Q5","v":0},{"$f":"(F5/1000000)*$Q5","v":0},{"$f":"(G5/1000000)*$Q5","v":0},{"$f":"(H5/1000000)*$Q5","v":0},{"$f":"1/((1+$T$1)^(J5-$Q$2))","v":0.93457943925233644}]
[null,2020,{"$f":"'Traffic Group Benefits'!N10+'Traffic Group Benefits'!O10","v":0},{"$f":"'Traffic Group Benefits'!P10+'Traffic Group Benefits'!Q10","v":0},{"$f":"'Traffic Group Benefits'!R10","v":0},{"$f":"'Traffic Group Benefits'!S10","v":0},{"$f":"'Traffic Group Benefits'!T10+'Traffic Group Benefits'!U10","v":0},0,null,2020,0,0,0,0,0,0,0.87343872827321156]
[null,2021,{"$f":"'Traffic Group Benefits'!N11+'Traffic Group Benefits'!O11","v":0},{"$f":"'Traffic Group Benefits'!P11+'Traffic Group Benefits'!Q11","v":0},{"$f":"'Traffic Group Benefits'!R11","v":0},{"$f":"'Traffic Group Benefits'!S11","v":0},{"$f":"'Traffic Group Benefits'!T11+'Traffic Group Benefits'!U11","v":0},0,null,2021,0,0,0,0,0,0,0.81629787689085187]
[null,2022,{"$f":"'Traffic Group Benefits'!N12+'Traffic Group Benefits'!O12","v":0},{"$f":"'Traffic Group Benefits'!P12+'Traffic Group Benefits'!Q12","v":0},{"$f":"'Traffic Group Benefits'!R12","v":0},{"$f":"'Traffic Group Benefits'!S12","v":0},{"$f":"'Traffic Group Benefits'!T12+'Traffic Group Benefits'!U12","v":0},0,null,2022,0,0,0,0,0,0,0.7628952120475252]
{"$rows_left_out":31}
{"sheet":"Cost Summary (by Brdg)","index":3,"n_rows":38,"n_cols":10,"rows_kept":38,"cut":false,"hidden":false,"merged":[[1,4,1,6]]}
["Cost Summary","Bridge ID:",{"$f":"'BCA Summary'!B1","v":13783},null,"Discount Rate:",null,7.0000000000000007E-2]
[null,null,null,null,"7% Discount Rate"]
["Year","Construction Costs ($M's)","O&M Costs ($M's)","Total Costs ($M's)","Construction Costs ($M's)","O&M Costs ($M's)","Discount Factor",null,"Residual Value","Discounted Residual Value"]
[2017,{"$f":"('Individual Bridge Costs'!F7-'Individual Bridge Costs'!D7)/1000000","v":0.20737284868421058},{"$f":"('Individual Bridge Costs'!G7-'Individual Bridge Costs'!E7)/1000000","v":0},{"$f":"B4+C4","v":0.20737284868421058},{"$f":"B4*$G4","v":0.22188894809210533},{"$f":"C4*$G4","v":0},{"$f":"1/((1+$G$1)^($A4-$A$5))","v":1.07}]
[2018,{"$f":"('Individual Bridge Costs'!F8-'Individual Bridge Costs'!D8)/1000000","v":0},{"$f":"('Individual Bridge Costs'!G8-'Individual Bridge Costs'!E8)/1000000","v":0},{"$f":"B5+C5","v":0},{"$f":"B5*$G5","v":0},{"$f":"C5*$G5","v":0},{"$f":"1/((1+$G$1)^($A5-$A$5))","v":1}]
[2019,{"$f":"('Individual Bridge Costs'!F9-'Individual Bridge Costs'!D9)/1000000","v":3.3556009210526316E-2},{"$f":"('Individual Bridge Costs'!G9-'Individual Bridge Costs'!E9)/1000000","v":0},{"$f":"B6+C6","v":3.3556009210526316E-2},3.1360756271519921E-2,0,0.93457943925233644]
[2020,{"$f":"('Individual Bridge Costs'!F10-'Individual Bridge Costs'!D10)/1000000","v":0.29943753333333334},{"$f":"('Individual Bridge Costs'!G10-'Individual Bridge Costs'!E10)/1000000","v":-4.5040000000000002E-3},0.29493353333333333,0.26154033831193407,-3.9339680321425451E-3,0.87343872827321156]
[2021,{"$f":"('Individual Bridge Costs'!F11-'Individual Bridge Costs'!D11)/1000000","v":0.29943753333333334},{"$f":"('Individual Bridge Costs'!G11-'Individual Bridge Costs'!E11)/1000000","v":-4.5040000000000002E-3},0.29493353333333333,0.24443022272143369,-3.6766056375163968E-3,0.81629787689085187]
{"$rows_left_out":31}
{"sheet":"Traffic Group Benefits","index":4,"n_rows":60,"n_cols":24,"rows_kept":60,"cut":false,"hidden":false,"merged":[]}
[null,null,null,"Traffic Group","Yrs to 20T Post","Yrs to Closed"]
[null,null,"Choose from dropdown:",3,{"$f":"INDEX('Traffic Groups'!$N$2:$N$6,MATCH('Traffic Group Benefits'!$D$2,'Traffic Groups'!$A$2:$A$6,0))","v":5},{"$f":"INDEX('Traffic Groups'!$O$2:$O$6,MATCH('Traffic Group Benefits'!$D$2,'Traffic Groups'!$A$2:$A$6,0))","v":15}]
[]
[null,null,null,"Net difference between project and base (if new bridge is not open , no difference):",null,null,null,null,null,null,null,null,null,"Car","Truck","Car","Truck","Truck","All","Car","Truck"]
["Construction Status - Build","Bridge Status - Base","Year","Bridge AADT","Diverted Car Trips","Diverted Truck Trips","Diverted Car VMT","Diverted Truck VMT","Diverted Car VHT","Diverted Truck VHT","Fatalities","Personal Injury","Property Damage","Veh. Operating Costs","Veh. Operating Costs","Value of Personal Time","Value of Time Crew Time","Shipper Logistics Costs","Safety","Emissions","Emissions"]
[{"$f":"IF(C6<='Bridge List'!$M$7,\"Old bridge\",\"New bridge open\")","v":"Old bridge"},{"$f":"IF(AND($E$2=$F$2,C6-$C$8=$E$2),\"Posted & Closed\",IF(C6-$C$8=$E$2,\"Posted\",IF(C6-$C$8=$F$2,\"Closed\",\"\")))","v":""},2016,"N/A","N/A","N/A","N/A","N/A","N/A","N/A","N/A","N/A","N/A","N/A","N/A","N/A","N/A","N/A","N/A","N/A","N/A"]
[{"$f":"IF(C7<='Bridge List'!$M$7,\"Old bridge\",\"New bridge open\")","v":"Old bridge"},"",2017,"N/A","N/A","N/A","N/A","N/A","N/A","N/A","N/A","N/A","N/A","N/A","N/A","N/A","N/A","N/A","N/A","N/A","N/A"]
[{"$f":"IF(C8<='Bridge List'!$M$7,\"Old bridge\",\"New bridge open\")","v":"Old bridge"},"",2018,{"$f":"INDEX(TDC!$E$3:$E$7,MATCH('Traffic Group Benefits'!$D$2,TDC!$B$3:$B$7,0))","v":2190000},{"$f":"IF(C8<='Bridge List'!$M$7,0,IF(C8-$C$8>=$F$2,D8*$C$46,0))","v":0},{"$f":"IF(C8<='Bridge List'!$M$7,0,IF(C8-$C$8>=$E$2,D8*$C$47,0))","v":0},{"$f":"E8*$C$48","v":0},{"$f":"F8*$C$48","v":0},{"$f":"G8/$C$49","v":0},{"$f":"H8/$C$49","v":0},{"$f":"(($G8+$H8)/$C$56)*$C$50","v":0},{"$f":"(($G8+$H8)/$C$56)*$C$51","v":0},{"$f":"(($G8+$H8)/$C$56)*$C$52","v":0},{"$f":"G8*'Fixed Factors'!$D$3+G8*'Fixed Factors'!$D$7*'Fixed Factors'!$I$8","v":0},{"$f":"H8*'Fixed Factors'!$D$4+H8*'Fixed Factors'!$D$8*'Fixed Factors'!$I$7","v":0},{"$f":"I8*$C$57*$C$59","v":0},{"$f":"J8*$C$58*$C$60","v":0},{"$f":"J8*'Shipper-Logistics Costs'!$I$5*'Shipper-Logistics Costs'!$I$7*SUMPRODUCT('Shipper-Logistics Costs'!$D$6:$D$48,'Shipper-Logistics Costs'!$N$6:$N$48)","v":0},{"$f":"K8*$C$53+L8*$C$54+M8*$C$55","v":0},{"$f":"G8*'Fixed Factors'!$D$26","v":0},{"$f":"H8*'Fixed Factors'!$D$27","v":0}]
{"$rows_left_out":53}
{"sheet":"Individual Bridge Costs","index":5,"n_rows":42,"n_cols":10,"rows_kept":42,"cut":false,"hidden":false,"merged":[]}
[null,null,null,"Bridge (FED ID)","Yrs to 20T Post","Yrs to Closed","Expected Life"]
[null,null,"Bridge",{"$f":"'BCA Summary'!B1","v":13783},{"$f":"INDEX('Bridge List'!$C$2:$C$8,MATCH('Individual Bridge Costs'!$D$2,'Bridge List'!$A$2:$A$8,0))","v":5},{"$f":"INDEX('Bridge List'!$D$2:$D$8,MATCH('Individual Bridge Costs'!$D$2,'Bridge List'!$A$2:$A$8,0))","v":15},{"$f":"INDEX('Bridge List'!$G$2:$G$8,MATCH('Individual Bridge Costs'!$D$2,'Bridge List'!$A$2:$A$8,0))","v":30}]
[]
[null,null,null,"Base Case","Base Case","Project Case","Project Case"]
["Construction Status - Build","Bridge Status - Base","Year","Construction Costs","O&M","Construction Costs","O&M","Residual Value",null,"Row Index for Lookup"]
[{"$f":"IF(C6<='Bridge List'!$M$7,\"Old bridge\",\"New bridge open\")","v":"Old bridge"},{"$f":"IF(AND($E$2=$F$2,C6-$C$8=$E$2),\"Posted & Closed\",IF(C6-$C$8=$E$2,\"Posted\",IF(C6-$C$8=$F$2,\"Closed\",\"\")))","v":""},2016,"N/A","N/A","N/A","N/A","N/A"]
[{"$f":"IF(C7<='Bridge List'!$M$7,\"Old bridge\",\"New bridge open\")","v":"Old bridge"},{"$f":"IF(AND($E$2=$F$2,C7-$C$8=$E$2),\"Posted & Closed\",IF(C7-$C$8=$E$2,\"Posted\",IF(C7-$C$8=$F$2,\"Closed\",\"\")))","v":""},2017,0,0,{"$f":"HLOOKUP($D$2,'Capital Costs'!$B$2:$H$36,J8,FALSE)","v":207372.84868421056},0]
[{"$f":"IF(C8<='Bridge List'!$M$7,\"Old bridge\",\"New bridge open\")","v":"Old bridge"},"",2018,0,{"$f":"HLOOKUP($D$2,'O&M Costs'!$C$3:$I$36,J8,FALSE)","v":4504},{"$f":"HLOOKUP($D$2,'Capital Costs'!$B$2:$H$36,J9,FALSE)","v":0},{"$f":"HLOOKUP($D$2,'O&M Costs'!$C$40:$I$73,J8,FALSE)","v":4504},null,null,2]
{"$rows_left_out":35}
{"sheet":"TDC","index":6,"n_rows":7,"n_cols":7,"rows_kept":7,"cut":false,"hidden":false,"merged":[]}
[null,null,null,"Annualization:",365]
[null,"Traffic Group","# of Bridges","AADT","Annual Trips","% Cars","% Trucks"]
[null,1.1000000000000001,{"$f":"'Traffic Groups'!I2","v":2},{"$f":"'Traffic Groups'!K2","v":100},{"$f":"D3*$E$1","v":36500},{"$f":"1-G3","v":0.88},{"$f":"'Traffic Groups'!L2","v":0.12}]
[null,1.2,{"$f":"'Traffic Groups'!I3","v":2},{"$f":"'Traffic Groups'!K3","v":100},{"$f":"D4*$E$1","v":36500},{"$f":"1-G4","v":0.88},{"$f":"'Traffic Groups'!L3","v":0.12}]
[null,2.1,{"$f":"'Traffic Groups'!I4","v":4},{"$f":"'Traffic Groups'!K4","v":150},{"$f":"D5*$E$1","v":54750},0.88,{"$f":"'Traffic Groups'!L4","v":0.12}]
[null,2.2000000000000002,{"$f":"'Traffic Groups'!I5","v":4},{"$f":"'Traffic Groups'!K5","v":150},{"$f":"D6*$E$1","v":54750},0.88,{"$f":"'Traffic Groups'!L5","v":0.12}]
[null,3,{"$f":"'Traffic Groups'!I6","v":7},{"$f":"'Traffic Groups'!K6","v":6000},2190000,0.88,{"$f":"'Traffic Groups'!L6","v":0.12}]

{"sheet":"Traffic Groups","index":7,"n_rows":32,"n_cols":17,"rows_kept":32,"cut":false,"hidden":false,"merged":[[11,15,14,15],[11,16,20,16],[16,13,20,13],[22,13,25,13],[9,10,9,16],[11,10,20,10],[11,11,14,11],[11,12,25,12],[11,13,14,13],[11,14,25,14],[8,1,8,2],[8,3,8,4],[12,1,13,1],[12,3,15,3],[12,5,18,5],[12,2,13,2],[12,4,15,4]]}
["Traffic Group","Bridge ID (1)","Bridge ID (2)","Bridge ID (3)","Bridge ID (4)","Bridge ID (5)","Bridge ID (6)","Bridge ID (7)","Bridge Count","Detour Length","ADT","% Truck Traffic","Current Year","Yrs to 20T Post","Yrs to Closed"]
[1.1000000000000001,13079,10053,null,null,null,null,null,{"$f":"COUNT(B2:H2)","v":2},{"$f":"B13","v":3.5999999999999996},{"$f":"B11","v":100},0.12,2018,{"$f":"'Bridge List'!$M$2","v":5},{"$f":"'Bridge List'!$M$3","v":15}]
[1.2,13079,10053,null,null,null,null,null,{"$f":"COUNT(B3:H3)","v":2},{"$f":"C13","v":3.5999999999999996},{"$f":"C11","v":100},0.12,2018,{"$f":"'Bridge List'!$M$2","v":5},{"$f":"'Bridge List'!$M$3","v":15}]
[2.1,13079,10053,12934,12980,null,null,null,4,{"$f":"D13","v":1.9000000000000004},{"$f":"D11","v":150},0.12,2018,{"$f":"'Bridge List'!$M$2","v":5},{"$f":"'Bridge List'!$M$3","v":15}]
[2.2000000000000002,13079,10053,12934,12980,null,null,null,4,{"$f":"E13","v":1.9000000000000004},{"$f":"E11","v":150},0.12,2018,{"$f":"'Bridge List'!$M$2","v":5},{"$f":"'Bridge List'!$M$3","v":15}]
[3,13079,10053,12934,12980,13653,13925,13783,7,3.1,{"$f":"F11","v":6000},0.12,2018,{"$f":"'Bridge List'!$M$2","v":5},{"$f":"'Bridge List'!$M$3","v":15}]
[]
[]
{"$rows_left_out":25}
{"sheet":"Fixed Factors","index":8,"n_rows":41,"n_cols":11,"rows_kept":41,"cut":false,"hidden":false,"merged":[[32,2,32,5]]}
["Fixed Factors"]
["Facility","Mode","Purpose","Vehicle Operating Cost $/Mile (Free Flow)","Vehicle Operating Cost $/Mile (Congested)","Vehicle Operating Cost $/hour (Congested or Idle)","$ per Fatality","$ per Personal Injury","$ per Property Damage Accident"]
["Road","Passenger Car","All (Personal)",0.29056666666666664,0.29056666666666664,10.1698,9600000,174000,4327]
["Road","All Trucks","Freight",0.56299999999999994,0.56299999999999994,22.507000000000001,9600000,174000,4327]
[]
["Facility","Mode","Purpose","Avg. Fuel Consump.  Gallon/Mile (FF)","Avg. Fuel Consump.  Gallon/Mile (Cong.)","Avg. Fuel Consump. Gallon/hr (Cong. or Idle)",null,"Fuel Type","$ per Gallon"]
["Road","Passenger Car","All (Personal)",4.6296296000000001E-2,5.3240741000000001E-2,1.8634259259999999,null,"Diesel",3,"https://gasprices.aaa.com/?state=OK (Nov. 2018)"]
["Road","All Trucks","Freight",0.15625,0.21875,9.84375,null,"Gasoline",2.34,"https://gasprices.aaa.com/?state=OK (Nov. 2018)"]
{"$rows_left_out":34}
{"sheet":"Bridge List","index":9,"n_rows":8,"n_cols":13,"rows_kept":8,"cut":false,"hidden":false,"merged":[]}
["Bridge","Current Year","Yrs to 20T Post","Yrs to Closed","Constr Str Yr","Constr End Yr","Expected Life","Improvement Type",null,null,null,"All Bridges posted & closed at the same date (single corridor):"]
[13079,2018,{"$f":"$M$2","v":5},{"$f":"$M$3","v":15},{"$f":"$M$6","v":2020},{"$f":"$M$7","v":2022},75,"Replacement",null,null,null,"Yrs to 20T Post",5]
[10053,2018,{"$f":"$M$2","v":5},{"$f":"$M$3","v":15},{"$f":"$M$6","v":2020},{"$f":"$M$7","v":2022},75,"Replacement",null,null,null,"Yrs to Closed",15]
[13653,2018,5,15,2020,2022,75,"Replacement"]
[13925,2018,5,15,2020,2022,75,"Replacement",null,null,null,"Uniform Construction Period for All Bridges in Bundle:"]
[12934,2018,5,15,2020,2022,75,"Replacement",null,null,null,"Constr Str Yr",2020]
[12980,2018,5,15,2020,2022,30,"Rehabilitation",null,null,null,"Constr End Yr",2022]
[13783,2018,5,15,2020,2022,30,"Rehabilitation"]
{"$rows_left_out":1}
{"sheet":"Capital Costs","index":10,"n_rows":37,"n_cols":10,"rows_kept":37,"cut":false,"hidden":false,"merged":[[0,0,0,8]]}
["Total Bridge & Pavement Costs"]
["Year",13079,10053,13653,13925,12934,12980,13783,"Combined Total"]
[2017,298381.10684210528,228604.46684210526,273297.82500000007,438109.15500000009,213484.65868421056,192632.64868421055,207372.84868421056,{"$f":"SUM(B3:H3)","v":1851882.7097368424},"Right of Way, Utilities, & Engineering"]
[2018,0,0,0,0,0,0,0,0]
[2019,34762.666842105267,27009.706842105265,31123.555000000004,49435.92500000001,34235.099210526321,31918.209210526322,33556.009210526317,{"$f":"SUM(B5:H5)","v":242041.17131578951},"Right of Way, Utilities, & Engineering"]
[2020,729219.42333333334,499214.94333333336,905664.2466666667,1448931.2233333334,319583.87,250849.46666666667,299437.53333333333,{"$f":"SUM(B6:H6)","v":4452900.706666667},"Bridge Construction & for Bridges 13653 & 13925 Pavement Reconstruction "]
[2021,729219.42333333334,499214.94333333336,785865.84666666668,1329132.8233333335,319583.87,250849.46666666667,299437.53333333333,{"$f":"SUM(B7:H7)","v":4213303.9066666672},"Bridge Construction"]
[2022,729219.42333333334,499214.94333333336,785865.84666666668,1329132.8233333335,319583.87,250849.46666666667,299437.53333333333,4213303.9066666672,"Bridge Construction"]
{"$rows_left_out":30}
{"sheet":"O&M Costs","index":11,"n_rows":73,"n_cols":12,"rows_kept":73,"cut":false,"hidden":false,"merged":[[1,2,1,8],[38,2,38,8]]}
[]
[null,null,"Bridge and Pavement O&M Costs- Unimproved"]
[null,"Year",13079,10053,12934,12980,13653,13925,13783,null,"Annual  Bridge O&M (Unimproved)",4504]
[null,2018,{"$f":"$L$3","v":4504},4504,4504,4504,{"$f":"$L$3","v":4504},4504,{"$f":"$L$3","v":4504},null,"Annual  Bridge O&M (Improved)",{"$f":"4504*0.1","v":450.40000000000003}]
[null,2019,4504,4504,4504,4504,{"$f":"$L$3+$L$6","v":27583.4},{"$f":"$L$3+$L$6","v":27583.4},{"$f":"$L$3","v":4504}]
[null,2020,4504,4504,4504,4504,{"$f":"$L$3","v":4504},{"$f":"$L$3","v":4504},{"$f":"$L$3","v":4504},null,"Additional Pavement Maintenance - Minor Rehab",23079.4]
[null,2021,4504,4504,4504,4504,{"$f":"$L$3","v":4504},{"$f":"$L$3","v":4504},{"$f":"$L$3","v":4504},null,"Additional Pavement Maintenance - Preventative",7133.4000000000005]
[null,2022,{"$f":"$L$3","v":4504},4504,4504,4504,4504,4504,4504]
{"$rows_left_out":66}
{"sheet":"Shipper-Logistics Costs","index":12,"n_rows":50,"n_cols":29,"rows_kept":50,"cut":false,"hidden":false,"merged":[[3,27,4,28],[4,6,5,6],[5,15,6,15],[6,6,7,6],[3,1,3,4],[3,6,3,8],[3,10,4,13],[3,15,3,18],[3,22,3,23],[3,24,3,25]]}
[]
[]
[null,"Commodity Profile from FHWA Freight Analysis Framework (FAF) for Oklahoma City Combined Statistics Area (CSA) - 2016",null,null,null,null,null,null,null,null,null,null,null,null,null,null,null,null,null,null,null,"Only Use to Verify Calculations on \"Benefit Calculations\" tab"]
[null,"Freight Vehicle Commodity Mix Breakout",null,null,null,null,"Assumptions",null,null,null,"Bump Factor to change commodity sensitivity",null,null,null,null,"Model Inputs (By Year)",null,null,null,null,null,null,"Truck",null,"Rail",null,null,"Single Year Cost Savings Estimate"]
[null,"SCTG2","SCTG Description","Truck-Commodity Mix","Rail-Commodity Mix",null,"Freight Tons Per Veh","Truck",24.05,null,null,null,null,null,null,"In 2050:",null,"Base","Project",null,"SCTG2","SCTG Description","Base","Project","Base","Project"]
[null,1,"Live animals/fish",8.814407295683965E-3,null,null,null,null,null,null,"SCTG",1,"Live animals/fish",1.5,null,"Vehicle VHT","Truck",0,{"$f":"'Traffic Group Benefits'!J40","v":24115.255106637193},null,1,"Live animals/fish",{"$f":"R$6*$I$5*$I$7*$D6*$N6","v":0},{"$f":"S$6*$I$5*$I$7*$D6*$N6","v":12801.997503795164},{"$f":"R$7*$I$6*$I$8*$E6*$N6","v":0},0,null,"Truck Freight Cost Savings",{"$f":"SUM(W6:W48)-SUM(X6:X48)","v":-660789.31346183922}]
[null,2,"Cereal grains",1.4286261187302085E-2,null,null,"Cost Per Freight Ton Hour","Truck",1.6695,null,"SCTG",2,"Cereal grains",0.53,null,null,null,null,null,null,2,"Cereal grains",{"$f":"R$6*$I$5*$I$7*$D7*$N7","v":0},7331.4152749608538,0,0]
[null,3,"Other ag prods.",6.5278719022763233E-3,null,null,null,null,null,null,"SCTG",3,"Other ag prods.",0.83,null,null,null,null,null,null,3,"Other ag prods.",0,5246.1787091333208,0,0]
{"$rows_left_out":42}