{"text_format":"1","workbook":"xlsx","n_sheets":13,"sheets":["Blank Insurance Premium","Child Support Comp Entry","Legal Styling","Names and Signature Lines","Child Support Computation","Insurance Premium Calculator","CS Schedule","Insurance Premium","Cash Medical Table","RSO","Storage","Sheet1","Sheet2"],"not_rendered":{"charts":0,"images":2,"macros":1,"external_links":0,"defined_names":30,"comments":0,"pivot_tables":0},"unopened":[],"bounds":{"document_bytes":16777216,"sheet_cells":100000,"rows_first":2000,"rows_last":500,"rows_between":2000,"halvings":0,"cell_chars":16384,"cell_head_chars":4096},"cells_cut":0,"cells_raw":0,"read":"whole","date_system":"1900"}

{"sheet":"Blank Insurance Premium","index":0,"n_rows":1,"n_cols":1,"rows_kept":1,"cut":false,"hidden":true,"merged":[]}
[" "]

{"sheet":"Child Support Comp Entry","index":1,"n_rows":55,"n_cols":14,"rows_kept":55,"cut":false,"hidden":false,"merged":[[0,0,0,4],[2,8,2,12]]}
["\nCHILD SUPPORT COMPUTATION\n\nUse the Tab key to navigate to entry fields.  Each entry field will provide instructions on what to enter and whether or not it is required.  The Tab navigation will not include Column A.  Column B allows for entry of number of children or responsible person only when applicable.  Column C used for the Father's information when available.  Column D is used for the Mother's information when available.  Column E is for entry of Other custodian's information when applicable.  To reset and initialize this form for entry of a new calculation, press control r.  To print the legal style of this form, press control p.  \n"]
["Description of information or instruction","Info for calculation","Father","Mother","Other Custodian"]
["Press Reset button or Control-r to reset calculations",null,null,null,null,null," ",null,"\nCHILD SUPPORT COMPUTATION\n\nUse the Tab key to navigate to entry fields.  Each entry field will provide instructions on what to enter and whether or not it is required.  The Tab navigation will not include Column A.  Column B allows for entry of number of children or responsible person only when applicable.  Column C used for the Father's information when available.  Column D is used for the Mother's information when available.  Column E is for entry of Other custodian's information when applicable.  To reset and initialize this form for entry of a new calculation, press control r.  To print the legal style of this form, press control p.  \n"]
["Enter the number of children in this case",0,null,null,null,null," "]
["Enter gross monthly income\nAll sources, except income specifically excluded by 43 O.S. Section 118B(B)",null,0,0,null,null," "," "]
["Enter the amount of self-employment income included in the gross monthly income ",null,0,0,null," "," "," "]
["Deduction for self-employment tax",null,{"$f":"'Child Support Computation'!D20","v":0},{"$f":"'Child Support Computation'!E20","v":0},null,null,4]
["Gross monthly income less any self-employment tax*",null,{"$f":"'Child Support Computation'!D21","v":0},{"$f":"'Child Support Computation'!E21","v":0},null," ",5]
["Enter the amount of S.S.A. Title II benefits or veterans disability benefits paid for the benefit of the children.  Do NOT include S.S.I. benefits. (Enter in the column for the disabled or retired parent.)",null,0,0,null,null," "]
["Enter the court ordered support alimony actually paid in a prior case",null,0,0,null,null," "]
["Enter the court ordered monthly adjustment for marital debt",null,0,0,null,null," "," "," "]
["Enter the court ordered monthly child support actually paid for qualified out-of-home children",null,0,0,null,null," ","Father"]
["Enter the number of qualified in-home children excluding children on this case  ",null,0,0,null," "," ","Mother",null," "," "]
["Calculated amount of deduction for qualified in-home children using the number of qualified in-home children",null,{"$f":"'Child Support Computation'!D27","v":0},{"$f":"'Child Support Computation'!E27","v":0},null," ",11]
["Calculated adjusted gross monthly income* ",null,{"$f":"'Child Support Computation'!D28","v":0},{"$f":"'Child Support Computation'!E28","v":0}," ",null,12," "]
["Calculated percentage share of income\n",null,{"$f":"'Child Support Computation'!D29","v":0},{"$f":"'Child Support Computation'!E29","v":0}," ",null," "]
["Calculated base monthly obligation*  ",null,{"$f":"'Child Support Computation'!D30","v":0},{"$f":"'Child Support Computation'!E30","v":0}," ",null," "]
["Parenting time adjustment, if used",null,"Father","Mother","Combined"]
["Enter number of overnights for each parent\nIf less than 121 for either parent, skip this entry.",{"$f":"IF(SUM(C19:D19)>0,IF(SUM(C19:D19)=365,\"\",\"Combined must = 365 >>\"),\"\")","v":""},0,365," ",null," ","Other"]
["Calculated percentage of overnights with each parent ",null,{"$f":"'Child Support Computation'!D33","v":0},{"$f":"'Child Support Computation'!E33","v":1}," ",null," "]
["Adjustment factor to be used for shared parenting",{"$f":"'Child Support Computation'!C34","v":""}," ",null,{"$f":"IF(ISERROR(B21*E17),\"\",B21*E17)","v":""}," ",null," "," "," "]
["Calculated share of adjusted combined child support obligation",null,{"$f":"'Child Support Computation'!D35","v":""},{"$f":"'Child Support Computation'!E35","v":""}]
["Calculated respective adjusted base child support obligation",null,{"$f":"'Child Support Computation'!D36","v":""},{"$f":"'Child Support Computation'!E36","v":""},null," ","Father"]
["Calculated adjusted base monthly obligation because of shared parenting*",null,{"$f":"'Child Support Computation'!D37","v":0},{"$f":"'Child Support Computation'!E37","v":0},null," ","Mother"]
["Enter Obligor (person who pays) \n(Enter \"Father\" or \"Mother\")"," ",null,null,null,null," ",{"$f":"PROPER(B25)","v":" "}]
["Work and education-related child care expenses",null,"Father","Mother","Other Custodian"]
["Enter monthly child care expenses for children in this case.  Include any co-payments being paid by a parent receiving O.K.D.H.S. Child Care Subsidy.",null,0,0,0," "," "]
["Child care expense percentage share of the total",null,{"$f":"'Child Support Computation'!D41","v":0},{"$f":"'Child Support Computation'!E41","v":0},{"$f":"IF('Child Support Computation'!G40>0,IF(B25=\"mother\",\"\",IF(B25=\"father\",\"\",\"ERROR, Enter Obligor\")),\"\")","v":""}," "]
["Total child care adjustment to base monthly obligation  ",null,{"$f":"'Child Support Computation'!D42","v":0},{"$f":"'Child Support Computation'!E42","v":0}," "," "," "]
["Enter monthly health insurance premium costs\nThis premium represents the actual premium cost for any child(ren) in this case only.  Insurance Premium Worksheet is available if needed.    \nUse Cash Medical Support if any child is not covered by insurance.",null,0,0,0]
["Monthly health insurance share for each parent",null,{"$f":"'Child Support Computation'!D45","v":0},{"$f":"'Child Support Computation'!E45","v":0},{"$f":"IF(C25>0,IF(B25=\"mother\",\"\",IF(B25=\"father\",\"\",\"Enter Obligor\")),\"\")","v":""}]
["Total premium cost adjustment to base monthly obligation  ",null,{"$f":"'Child Support Computation'!D46","v":0},{"$f":"'Child Support Computation'!E46","v":0}," ",null,null,null," ",null,null,null,null," "]
["Enter ongoing medical costs\nCash medical support for fixed periodic payments for ongoing medical costs",null,0,0,0]
["Adjusted medical costs share  ",null,{"$f":"'Child Support Computation'!D49","v":0},{"$f":"'Child Support Computation'!E49","v":0},{"$f":"IF('Child Support Comp Entry'!G48>0,IF(G25<>\"mother\",\"\",IF(G25=\"father\",\"\",\"Enter Obligor in proper line\")),IF('Child Support Comp Entry'!G48>0>0,IF(G25=\"mother\",\"\",IF(G25<>\"father\",\"\",\"Enter Obligor in proper line\")),\"\"))","v":""},null,null,null,null,null,null,null,null," "]
["Total ongoing medical costs adjustment to base monthly obligation  ",null,{"$f":"'Child Support Computation'!D50","v":0},{"$f":"'Child Support Computation'!E50","v":0}]
["Enter visitation transportation costs ",null,0,0,0]
["Adjusted visitation costs share  ",null,{"$f":"'Child Support Computation'!D52","v":0},{"$f":"'Child Support Computation'!E52","v":0},{"$f":"IF('Child Support Computation'!G51>0,IF(B25=\"mother\",\"\",IF(B25=\"father\",\"\",\"Enter Obligor in proper line\")),IF('Child Support Computation'!G51>0,IF(B25=\"mother\",\"\",IF(B25=\"father\",\"\",\"Enter Obligor in proper line\")),\"\"))","v":""},null,null,null,null,null,null,null,null," "]
["Total ongoing visitation costs adjustment to base monthly obligation  ",null,{"$f":"'Child Support Computation'!D53","v":0},{"$f":"'Child Support Computation'!E53","v":0}]
["Base monthly child support obligation less adjustments for child care and other contributions*",null,0,0,0]
["S.S.A. Title II benefits or veterans disability benefits paid for the benefit of the child        ",null,{"$f":"'Child Support Computation'!D56","v":""},{"$f":"'Child Support Computation'!E56","v":""}]
["Total monthly child support obligation less any \nS.S.A. Title II benefits or veterans disability benefits  paid for the benefit of the child  ",null,{"$f":"'Child Support Computation'!D57","v":0},{"$f":"'Child Support Computation'!E57","v":0},null,null,null,null," "]
["Enter number of children in this case not covered by health insurance.  Note: This may be different from the number of children on SoonerCare. ",null,0,0,0,null,null," "]
["Enter the Soonercare or other health care government assistance applicant for the child(ren) in this case not covered by insurance.  Enter \"Father\", \"Mother\", \"other\" or leave blank.","",{"$f":"IF(ISNUMBER(C59),IF(C59>0,IF(C60=\"mother\",\"\",IF(C60=\"father\",\"\",IF(C60=\"other\",\"\",IF(C60=\"\",\"\",IF(C60=\" \",\"\",\"                        CORRECT FIELD REQUIRED\"))))),\"\"),\"\")","v":""},null,null,null,null,{"$f":"PROPER(B43)","v":""}]
["Cash medical amount for obligor",null,{"$f":"'Child Support Computation'!D61","v":0},{"$f":"'Child Support Computation'!E61","v":0}]
["5% of Gross Monthly Income for Obligor\nThis represents the maximum amount of total medical allowed.",null,0,0,0,null,null,null," "]
["Cash medical support in lieu of insurance  ",null,{"$f":"'Child Support Computation'!D63","v":0},{"$f":"'Child Support Computation'!E63","v":0}]
["Child support portion",null,{"$f":"'Child Support Computation'!D66","v":""},{"$f":"'Child Support Computation'!E66","v":""}," ",null,null,{"$f":"'Child Support Computation'!ID66","v":0},{"$f":"'Child Support Computation'!IE66","v":0}]
["Cash medical portion",null,{"$f":"'Child Support Computation'!D67","v":""},{"$f":"'Child Support Computation'!E67","v":""},null,null,null,{"$f":"'Child Support Computation'!D67","v":""},{"$f":"'Child Support Computation'!E67","v":""}]
["Ongoing medical costs portion",null,{"$f":"'Child Support Computation'!D68","v":""},{"$f":"'Child Support Computation'!E68","v":""},null,null,null,{"$f":"'Child Support Computation'!D68","v":""},{"$f":"'Child Support Computation'!E68","v":""}]
["Total obligation to be paid by the obligor",null,{"$f":"'Child Support Computation'!D69","v":""},{"$f":"'Child Support Computation'!E69","v":""},null," ",null,{"$f":"'Child Support Computation'!D69","v":""},{"$f":"'Child Support Computation'!E69","v":""}]
["Press Print button or Control-p. to print completed guidelines form"]
[]
[null,"Mother"]
[null,"Father"]
[null,"Other"]

{"sheet":"Legal Styling","index":2,"n_rows":80,"n_cols":5,"rows_kept":80,"cut":false,"hidden":false,"merged":[[0,0,0,1]]}
["CHILD SUPPORT COMPUTATION LEGAL STYLE (OPTIONAL)",null,null,null," "]
["Description of information or instruction","Information for legal style",null,null,"ADMINISTRATIVE REVIEW"]
["Enter District Court County","Administrative Review",null,null,"ADAIR"]
["Enter Style Line 1"," ",null,null,"ALFALFA  "]
["Enter Style Line 2"," ",null,null,"ATOKA    "]
["Enter Style Line 3"," ",null,null,"BEAVER   "]
["Enter Style Line 4"," ",null,null,"BECKHAM  "]
["Enter Style Line 5"," ",null,null,"BLAINE   "]
["Enter District Court Case Number"," ",null,null,"BRYAN    "]
["Enter O.A.H. Case Number"," ",null,null,"CADDO    "]
["Enter Family Group Number"," ",null,null,"CANADIAN "]
[null,null,null,null,"CARTER   "]
[null,null,null,null,"CHOCTAW   "]
[null,null,null,null,"CIMARRON  "]
[null,null,null,null,"CLEVELAND "]
[null,null,null,null,"COAL      "]
[null,null,null,null,"COMANCHE  "]
[null,null,null,null,"COTTON    "]
[null,null,null,null,"CRAIG     "]
[null,null,null,null,"CREEK     "]
[null,null,null,null,"CUSTER    "]
[null,null,null,null,"DELAWARE  "]
[null,null,null,null,"DEWEY     "]
[null,null,null,null,"ELLIS     "]
[null,null,null,null,"GARFIELD  "]
[null,null,null,null,"GARVIN    "]
[null,null,null,null,"GRADY     "]
[null,null,null,null,"GRANT     "]
[null,null,null,null,"GREER     "]
[null,null,null,null,"HARMON    "]
[null,null,null,null,"HARPER    "]
[null,null,null,null,"HASKELL   "]
[null,null,null,null,"HUGHES    "]
[null,null,null,null,"JACKSON   "]
[null,null,null,null,"JEFFERSON "]
[null,null,null,null,"JOHNSTON  "]
[null,null,null,null,"KAY       "]
[null,null,null,null,"KINGFISHER"]
[null,null,null,null,"KIOWA     "]
[null,null,null,null,"LATIMER   "]
[null,null,null,null,"LEFLORE   "]
[null,null,null,null,"LINCOLN   "]
[null,null,null,null,"LOGAN     "]
[null,null,null,null,"LOVE      "]
[null,null,null,null,"MCCLAIN   "]
[null,null,null,null,"MCCURTAIN "]
[null,null,null,null,"MCINTOSH  "]
[null,null,null,null,"MAJOR     "]
[null,null,null,null,"MARSHALL  "]
[null,null,null,null,"MAYES     "]
[null,null,null,null,"MURRAY      "]
[null,null,null,null,"MUSKOGEE    "]
[null,null,null,null,"NOBLE       "]
[null,null,null,null,"NOWATA      "]
[null,null,null,null,"OKFUSKEE    "]
[null,null,null,null,"OKLAHOMA    "]
[null,null,null,null,"OKMULGEE    "]
[null,null,null,null,"OSAGE       "]
[null,null,null,null,"OTTAWA      "]
[null,null,null,null,"PAWNEE      "]
[null,null,null,null,"PAYNE       "]
[null,null,null,null,"PITTSBURG   "]
[null,null,null,null,"PONTOTOC    "]
[null,null,null,null,"POTTAWATOMIE"]
[null,null,null,null,"PUSHMATAHA  "]
[null,null,null,null,"ROGER MILLS "]
[null,null,null,null,"ROGERS      "]
[null,null,null,null,"SEMINOLE    "]
[null,null,null,null,"SEQUOYAH    "]
[null,null,null,null,"STEPHENS   "]
[null,null,null,null,"TEXAS      "]
[null,null,null,null,"TILLMAN    "]
[null,null,null,null,"TULSA      "]
[null,null,null,null,"WAGONER    "]
[null,null,null,null,"WASHINGTON "]
[null,null,null,null,"WASHITA    "]
[null,null,null,null,"WOODS      "]
[null,null,null,null,"WOODWARD   "]
[]
[null,null,null,null," "]

{"sheet":"Names and Signature Lines","index":3,"n_rows":15,"n_cols":2,"rows_kept":15,"cut":false,"hidden":false,"merged":[[0,0,0,1]]}
["\nCHILD SUPPORT COMPUTATION NAMES AND SIGNATURE LINES (OPTIONAL)\n\nEntry information will print exactly as entered on the guideline."]
["Description of information or instruction","Information for legal style"]
["Enter who should begin payments"]
["Enter the date payments begin"]
["Were guidelines followed?"," "]
["Was there a deviation from child support guidelines by Court-Specific findings of Court supporting each deviation?"," "]
["Enter deviation description ","                                                                                              ____________________________________________________________________________________________\n                                                              ____________________________________________________________________________________________\n                                                                          ____________________________________________________________________________________________"]
["Enter the date"," "]
["Enter the Father's name"," "]
["Enter the Father's attorney's name"," "]
["Enter the Mother's name"," "]
["Enter the Mother's attorney's name"," "]
["Enter the name of Other custodian"," "]
["Enter the name of Other custodian's attorney"," "]
["Enter the State's attorney, CSS"," "]

{"sheet":"Child Support Computation","index":4,"n_rows":122,"n_cols":15,"rows_kept":122,"cut":false,"hidden":true,"merged":[[86,0,86,5],[90,0,90,1],[89,2,89,5],[94,2,94,5],[106,2,106,5],[101,2,101,5],[95,0,95,1],[95,2,95,5],[100,0,100,1],[90,2,90,5],[85,3,85,5],[85,0,85,2],[121,2,121,5],[114,0,114,1],[114,2,114,5],[119,0,119,1],[119,2,119,5],[120,0,120,1],[120,2,120,5],[115,0,115,1],[115,2,115,5],[111,2,111,5],[89,0,89,1],[91,2,91,5],[104,0,104,1],[104,2,104,5],[94,0,94,1],[100,2,100,5],[105,0,105,1],[105,2,105,5],[110,0,110,1],[110,2,110,5],[109,0,109,1],[109,2,109,5],[7,4,7,5],[19,1,19,2],[14,3,15,5],[24,1,24,2],[23,1,23,2],[25,1,25,2],[30,1,30,2],[96,2,96,5],[99,0,99,1],[99,2,99,5],[74,1,74,5],[83,0,83,2],[78,0,78,5],[84,3,84,5],[83,3,83,5],[77,0,77,5],[25,0,26,0],[27,1,27,2],[22,0,24,0],[28,1,28,2],[29,1,29,2],[39,1,39,2],[25,5,26,5],[26,1,26,2],[3,4,3,5],[4,0,4,1],[4,2,4,3],[4,4,4,5],[3,0,3,1],[3,2,3,3],[20,1,20,2],[5,0,5,1],[5,2,5,3],[6,0,6,1],[7,0,7,1],[6,2,6,3],[7,2,7,3],[18,5,24,5],[8,0,8,5],[16,1,16,2],[17,1,17,2],[12,3,13,5],[12,0,12,2],[22,1,22,2],[21,1,21,2],[18,1,18,2],[5,4,5,5],[6,4,6,5],[31,7,31,10],[32,1,32,2],[34,5,36,5],[67,1,67,2],[66,1,66,2],[64,1,64,2],[46,1,46,2],[48,1,48,2],[54,1,54,2],[51,1,51,2],[49,1,49,2],[52,1,52,2],[33,3,33,4],[37,3,37,4],[42,1,42,2],[40,1,40,2],[61,1,61,2],[57,1,57,2],[60,1,60,2],[43,1,43,2],[63,0,63,5],[65,1,65,2],[55,1,55,2],[47,1,47,2],[74,6,74,11],[56,1,56,2],[69,6,69,11],[75,0,75,5],[76,0,76,5],[62,1,62,2],[65,5,68,5],[34,1,34,2],[35,1,35,2],[36,1,36,2],[70,0,70,5],[68,1,68,2],[73,1,73,5],[71,0,71,5],[44,1,44,2],[45,1,45,2],[53,1,53,2],[41,1,41,2],[38,1,38,2]]}
[{"$f":"IF(G2=\"ADMINISTRATIVE REVIEW\",\"OFFICE OF ADMINISTRATIVE HEARINGS: CHILD SUPPORT\" & (CHAR(10)) & \"DEPARTMENT OF HUMAN SERVICES\",G1)","v":"OFFICE OF ADMINISTRATIVE HEARINGS: CHILD SUPPORT\nDEPARTMENT OF HUMAN SERVICES"},null,null,null,null,null,{"$f":"IF('Legal Styling'!B3=\"\",\"\",IF('Legal Styling'!B3=\" \",\"\",\"IN THE DISTRICT COURT OF \" & 'Legal Styling'!B3 & \" COUNTY\"))","v":"IN THE DISTRICT COURT OF Administrative Review COUNTY"}]
["STATE OF OKLAHOMA",null,null,null,null,null,{"$f":"'Legal Styling'!B3","v":"Administrative Review"}]
[null,null,null,null," "]
[{"$f":"'Legal Styling'!B4","v":" "},null,"    )    Dist. Ct. Case No.",null,{"$f":"'Legal Styling'!B9","v":" "}]
[{"$f":"'Legal Styling'!B5","v":" "},null,"    )\n    )    OAH Case No.",null,{"$f":"'Legal Styling'!B10","v":" "},null,null,null," "," "]
[{"$f":"'Legal Styling'!B6","v":" "},null,"    )\n    )                   FGN:",null,{"$f":"'Legal Styling'!B11","v":" "},null,null,null," "," "]
[{"$f":"'Legal Styling'!B7","v":" "},null,"    )\n    )    ",null,"",null,null,null," "]
[{"$f":"'Legal Styling'!B8","v":" "},null,"    )\n    )    ",null,null,null,null,null," "]
["CHILD SUPPORT COMPUTATION"]
[null,null,"Father","Father",""]
[null,null,"Mother","Mother",""]
[null,null,null," ",""]
[null,null,null,{"$f":"IF(ISERROR(C14*1),\"\",IF(C14>6,\"Number of children exceeds\" & (CHAR(10)) & \"Child Support Guideline Schedule.\" & (CHAR(10)) & \"See 43 O.S. § 119 (C).\",\"\"))","v":""},null,null,null," "]
[null,"Calculation for number of children in this case",{"$f":"'Child Support Comp Entry'!B4","v":0}]
[null,"Obligor (person who pays) is\n(Enter \"Father\" or \"Mother\")",{"$f":"IF(C38=\"Father\",\"Father\",IF(C38=\"Mother\",\"Mother\",\"\"))","v":""},{"$f":"IF(F28>15000,\"Combined income on Line 3 exceeds\" & (CHAR(10)) & \"Child Support Guideline Schedule.\" & (CHAR(10)) & \"See 43 O.S. § 119 (B).\",\"\")","v":""},null,null," "," "," "]
[null,null,null,null,null,null,null," "]
["A","Base monthly obligation",null,"Father","Mother","Combined"]
[1,"Gross monthly income\nAll sources, except income specifically excluded by 43 O.S. Section 118B(B)",null,{"$f":"'Child Support Comp Entry'!C5","v":0},{"$f":"'Child Support Comp Entry'!D5","v":0},{"$f":"(SUM(D18:E18))","v":0},null,null," "]
[null,"     a. Amount of self-employment income included in Line 1 ",null,{"$f":"'Child Support Comp Entry'!C6","v":0},{"$f":"'Child Support Comp Entry'!D6","v":0},null," ",null," "]
[null,"     b. Deduction for self-employment tax\n         Multiply Line 1a by 7.65% ",null,{"$f":"IF(ISERROR(D19*0.0765),0,ROUND(D19*0.0765,2))","v":0},{"$f":"IF(ISERROR(E19*0.0765),0,ROUND(E19*0.0765,2))","v":0}]
[2,"Total gross monthly income \nLine 1 minus Line 1b",null,{"$f":"IF(ISERROR(D18-D20),0,D18-D20)","v":0},{"$f":"IF(ISERROR(E18-E20),0,E18-E20)","v":0},null," "]
[null,"     a. Amount of SSA Title II benefits or veterans disability \n         benefits paid for the benefit of the children.  \n         Do NOT include SSI benefits. (Enter in the column for the \n         disabled or retired parent.)",null,{"$f":"'Child Support Comp Entry'!C9","v":0},{"$f":"'Child Support Comp Entry'!D9","v":0},null,null,{"$f":"IF(ISNUMBER(D22),D21+D22,D21)","v":0},{"$f":"IF(ISNUMBER(E22),E21+E22,E21)","v":0}]
[" ","     b. Court ordered support alimony actually paid in a \n         prior case",null,{"$f":"'Child Support Comp Entry'!C10","v":0},{"$f":"'Child Support Comp Entry'!D10","v":0},null,null,{"$f":"IF(ISNUMBER(D23),D23,0)","v":0},0]
[null,"     c. Court ordered monthly adjustment for marital debt",null,{"$f":"'Child Support Comp Entry'!C11","v":0},{"$f":"'Child Support Comp Entry'!D11","v":0},null,null,0,0," "]
[null,"     d. Court ordered monthly child support actually paid for\n         qualified out-of-home children",null,{"$f":"'Child Support Comp Entry'!C12","v":0},{"$f":"'Child Support Comp Entry'!D12","v":0},null,null,0,0]
[null,"In-home Children Deduction Worksheet\n     e. Number of qualified in-home children excluding\n         children on this case  ",null,{"$f":"'Child Support Comp Entry'!C13","v":0},{"$f":"'Child Support Comp Entry'!D13","v":0},null," ",{"$f":"IF(ISERROR(ROUND(VLOOKUP(D21,'CS Schedule'!A9:H298,MIN(D26+2,8),TRUE),0)),0,ROUND(VLOOKUP(D21,'CS Schedule'!A9:H298,MIN(D26+2,8),TRUE),0))","v":0},{"$f":"IF(ISERROR(ROUND(VLOOKUP(E21,'CS Schedule'!A9:H298,MIN(E26+2,8),TRUE),0)),0,ROUND(VLOOKUP(E21,'CS Schedule'!A9:H298,MIN(E26+2,8),TRUE),0))","v":0},null," "," "]
[null,"     f.  Amount for qualified in-home children. \n         Apply Line 2 for each parent to Child Support\n         Guideline Schedule amount using the \n         number of children in Line 2e, and multiply\n         guideline amount by 75%  ",null,{"$f":"IF(D26<>\"\",H26*0.75,\"\")","v":0},{"$f":"IF(E26<>\"\",I26*0.75,\"\")","v":0},null," "," "]
[3,"Adjusted gross monthly income (AGI)\nAmount in Line 2 plus 2a, minus Lines 2b, 2c, 2d, and 2f",null,{"$f":"IF(H28>0,H28,0)","v":0},{"$f":"IF(I28>0,I28,0)","v":0},{"$f":"IF(ISERROR(D28+E28),\"\",D28+E28)","v":0}," ",{"$f":"IF(ISNUMBER(D21),H22-(H23+H24+H25+D27),0)","v":0},{"$f":"IF(ISNUMBER(E21),I22-(I23+I24+I25+E27),0)","v":0}]
[4,"Percentage share of income\nAGI for each parent divided by the combined AGI",null,{"$f":"IF(H29<0,0,IF(H29>1,1,H29))","v":0},{"$f":"IF(I29<0,0,IF(I29>1,1,I29))","v":0},1,null,{"$f":"IF(ISERROR(D28/$F28),0,ROUND(D28/$F28,7))","v":0},{"$f":"IF(ISERROR(E28/$F28),0,ROUND(E28/$F28,7))","v":0}]
[5,"Base monthly obligation  \nApply combined AGI to Child Support Guideline Schedule and put total in combined base monthly obligation.  Multiply the combined total by the percentage share of income for each parent.",null,{"$f":"ROUND(D29*$F30,2)","v":0},{"$f":"ROUND(E29*$F30,2)","v":0},{"$f":"IF(ISERROR(ROUND(VLOOKUP(F28,'CS Schedule'!A9:H298,MIN(C14+2,8),TRUE),0)),0,ROUND(VLOOKUP(F28,'CS Schedule'!A9:H298,MIN(C14+2,8),TRUE),0))","v":0}]
["B","Parenting time adjustment, if used",null,"Father","Mother","Combined"]
[6,"Number of overnights with each parent\nIf less than 121 for either parent, skip to C.",{"$f":"IF(SUM(D32:E32)>0,IF(SUM(D32:E32)=365,\"\",\"Combined must = 365 >>\"),\"\")","v":""},{"$f":"'Child Support Comp Entry'!C19","v":0},{"$f":"IF(ISNUMBER(D32),ROUND(365-D32,2),\"\")","v":365},{"$f":"MAX(ROUND(SUM(D32),0),0)+MAX(ROUND(SUM(E32),0),0)","v":365},{"$f":"IF(ISNUMBER(D32),IF(D32=182,1.5,IF(D32=183,1.5,IF(D32>E32,\"father\",\"mother\"))),\"\")","v":"mother"}," "]
[" ","     a. Percentage of overnights with each parent \n         Number of overnights for each parent divided by 365",null,{"$f":"IF(D32<0,0,IF(D32=182,0.5,IF(D32=183,0.5,IF(SUM(D32:E32)=365,ROUND((ROUND(SUM(D32),0))/F32,7),0))))","v":0},{"$f":"IF(E32<0,0,IF(E32=182,0.5,IF(E32=183,0.5,IF(SUM(D32:E32)=365,ROUND((ROUND(SUM(E32),0))/F32,7),0))))","v":1},{"$f":"IF(SUM(D33:E33)>0,SUM(D33:E33),\"\")","v":1},null," "]
[" ","     b. Adjusted combined child support obligation\n         Adjustment factor is based on the parent \n         with the fewest overnights.  The result in the\n         combined column is the combined monthly \n         obligation in Line 5 multiplied by the \n         adjustment factor.",{"$f":"IF(ISNUMBER(G32),G32,IF(G32=\"\",\"\",IF(G32=\"mother\",IF(D32>143,1.5,IF(D32>131,1.75,IF(D32>120,2,\"\"))),IF(E32>143,1.5,IF(E32>131,1.75,IF(E32>120,2,\"\"))))))","v":""},"<=== Adjustment Factor   \n  less than 121 = no factor\n          121-131 = 2\n          132-143 = 1.75\n          144-183 = 1.5",null,{"$f":"IF(ISERROR(C34*F30),\"\",C34*F30)","v":""}," ",null," "," "," "]
[" ","     c. Share of adjusted combined child support obligation\n         Combined Line 6b multiplied by the percentage share\n         of income in Line 4",null,{"$f":"IF(ISERROR(D29*F34),\"\",ROUND(D29*F34,2))","v":""},{"$f":"IF(ISERROR(E29*F34),\"\",ROUND(E29*F34,2))","v":""}]
[" ","     d. Respective adjusted base child support obligation\n         Amount for each parent in Line 6c multiplied by the\n         percentage of the other parent in Line 6a ",null,{"$f":"IF(D35<>\"\",ROUND(E33*D35,2),\"\")","v":""},{"$f":"IF(E35<>\"\",ROUND(D33*E35,2),\"\")","v":""}]
[7,"Adjusted base monthly obligation\nLine 6d larger amount minus Line 6d smaller amount and the result is for the parent with the positive amount. If the parent has more than 205 in Line 6, use $0 for that parent.  If either parent has less than 121 in Line 6, use the Line 5 amount for both parents.  ",null,{"$f":"IF(ISNUMBER(D32),IF(H37>D30,D30,H37))","v":0},{"$f":"IF(ISNUMBER(E32),IF(I37>E30,E30,I37))","v":0},null," ",{"$f":"IF(ISNUMBER(D32),IF(D32>205,0,IF(ISERROR(D36*1),D30,IF(D36>E36,IF(ROUND(D36-E36,2)>0,ROUND(D36-E36,2),0),0))),D30)","v":0},{"$f":"IF(ISNUMBER(E32),IF(E32>205,0,IF(ISERROR(E36*1),E30,IF(E36>D36,IF(ROUND(E36-D36,2)>0,ROUND(E36-D36,2),0),0))),E30)","v":0}]
["C ","Obligor (person who pays) is\n(Enter \"Father\" or \"Mother\")",{"$f":"PROPER('Child Support Comp Entry'!B25)","v":" "},null,null,null,null," "," "]
["D","Work and education-related child care expenses",null,"Father","Mother","Other Custodian"]
[8,"Monthly child care expenses for children in this case\nInclude any co-payments being paid by a parent\nreceiving OKDHS Child Care Subsidy.",null,{"$f":"'Child Support Comp Entry'!C27","v":0},{"$f":"'Child Support Comp Entry'!D27","v":0},{"$f":"'Child Support Comp Entry'!E27","v":0},{"$f":"SUM(D40:F40)","v":0}," "]
[9,"Child care expense percentage share of the total\nTotal child care expenses multiplied by percentage\nshare of income for each parent \nMultiply Line 8 by Line 4",null,{"$f":"IF(ISERROR(G40*D29),0,ROUND((G40*D29),2))","v":0},{"$f":"IF(ISERROR(G40*E29),0,ROUND((G40*E29),2))","v":0},{"$f":"IF(G40>0,IF(C38=\"mother\",\"\",IF(C38=\"father\",\"\",\"ERROR, Enter Obligor in Line C\")),\"\")","v":""}," "]
[10,"Total child care adjustment to base monthly obligation  \nLine 9 minus Line 8 (amount may be negative)",null,{"$f":"IF(ISERROR(D41-D40),0,(D41-D40))","v":0},{"$f":"IF(ISERROR(E41-E40),0,(E41-E40))","v":0}," "," "," "]
["E","Health insurance premium",null,"Father","Mother","Other Custodian",null," "]
[11,"Monthly health insurance premium costs\nThis premium represents the actual premium cost for any child(ren) in this case only.  Insurance Premium Worksheet is available if needed.    \nUse Cash Medical Support if any child is not covered by insurance.",null,{"$f":"'Child Support Comp Entry'!C30","v":0},{"$f":"'Child Support Comp Entry'!D30","v":0},{"$f":"'Child Support Comp Entry'!E30","v":0}," ",{"$f":"SUM(D44:F44)","v":0}]
[12,"Monthly health insurance share for each parent\nPercentage share of income in Line 4 multiplied by\ntotal current insurance cost for all persons in Line 11",null,{"$f":"IF(ISNUMBER(H44),ROUND(H44*D29,2),0)","v":0},{"$f":"IF(ISNUMBER(H44),ROUND(H44*E29,2),0)","v":0},{"$f":"IF(H44>0,IF(C38=\"mother\",\"\",IF(C38=\"father\",\"\",\"Enter Obligor in Line C\")),\"\")","v":""}," "," "]
[13,"Total premium cost adjustment to base monthly obligation\nLine 12 minus Line 11  (amount may be negative)  ",null,{"$f":"IF(ISERROR(D45-D44),0,D45-D44)","v":0},{"$f":"IF(ISERROR(E45-E44),0,E45-E44)","v":0}," "," "," ",null," ",null,null,null,null," "]
["F","Other contributions, if agreed or ordered",null,"Father","Mother","Other Custodian"]
[14,"Ongoing medical costs\nCash medical support for fixed periodic payments for ongoing medical costs",null,{"$f":"'Child Support Comp Entry'!C33","v":0},{"$f":"'Child Support Comp Entry'!D33","v":0},{"$f":"'Child Support Comp Entry'!E33","v":0}," ",{"$f":"SUM(D48:F48)","v":0}]
[" ","    a. Adjusted medical costs share  \n        Multiply total of Line 14 for all persons by Line 4",null,{"$f":"IF(ISERROR((H48)*D29),0,ROUND((H48)*D29,2))","v":0},{"$f":"IF(ISERROR((H48)*E29),0,ROUND((H48)*E29,2))","v":0},{"$f":"IF(H48>0,IF(C15=\"mother\",\"\",IF(C15=\"father\",\"\",\"Enter Obligor in Line C\")),IF(H48>0,IF(C15=\"mother\",\"\",IF(C15=\"father\",\"\",\"Enter Obligor in Line C\")),\"\"))","v":""}," "," ",null,null,null,null,null,null," "]
[" ","    b. Total ongoing medical costs adjustment to \n        base monthly obligation  \n        Line 14a minus Line 14  (amount may be negative)",null,{"$f":"IF(ISERROR(D49-D48),0,ROUND(D49-D48,2))","v":0},{"$f":"IF(ISERROR(E49-E48),0,ROUND(E49-E48,2))","v":0}]
[15,"Visitation transportation costs ",null,{"$f":"'Child Support Comp Entry'!C36","v":0},{"$f":"'Child Support Comp Entry'!D36","v":0},{"$f":"'Child Support Comp Entry'!E36","v":0},null,{"$f":"SUM(D51:F51)","v":0}]
[" ","    a. Adjusted visitation costs share  \n        Multiply total of Line 15 for all persons by Line 4",null,{"$f":"IF(ISERROR(H51*D29),0,ROUND(H51*D29,2))","v":0},{"$f":"IF(ISERROR(H51*E29),0,ROUND(H51*E29,2))","v":0},{"$f":"IF(H51>0,IF(C15=\"mother\",\"\",IF(C15=\"father\",\"\",\"Enter Obligor in Line C\")),IF(H51>0,IF(C15=\"mother\",\"\",IF(C15=\"father\",\"\",\"Enter Obligor in Line C\")),\"\"))","v":""}," "," ",null,null,null,null,null,null," "]
[" ","    b. Total ongoing visitation costs adjustment to\n        base monthly obligation  \n        Line 15a minus Line 15  (amount may be negative)",null,{"$f":"IF(ISERROR(D52-D51),0,ROUND(D52-D51,2))","v":0},{"$f":"IF(ISERROR(E52-E51),0,ROUND(E52-E51,2))","v":0}]
["G","Child Support obligation subtotal",null,"Father","Mother"]
[16,"Base monthly child support obligation less adjustments for child care and other contributions\nAdd obligor Line 7 to Lines 10, 13 and 15b if positive amounts. Subtract Lines 10, 13 or 15b if negative amounts.",null,{"$f":"IF(C15=\"father\",(D37+D42+D46+D53),0)","v":0},{"$f":"IF(C15=\"mother\",(E37+E42+E46+E53),0)","v":0},null," "]
[17,"SSA Title II benefits or veterans disability benefits paid for the benefit of the child \nLine 2a for obligor        ",null,{"$f":"IF(C15=\"father\",IF(ISNUMBER(D22),D22,0),\"\")","v":""},{"$f":"IF(C15=\"mother\",IF(ISNUMBER(E22),E22,0),\"\")","v":""},null," "," "]
[18,"Total monthly child support obligation less any \nSSA Title II benefits or veterans disability benefits paid for the benefit of the child \nLine 16 minus Line 17  (amount may be negative) \n ",null,{"$f":"IF(C15=\"father\",IF(ISERROR(D55-D56),0,ROUND(D55-D56,2)),0)","v":0},{"$f":"IF(C15=\"mother\",IF(ISERROR(E55-E56),0,ROUND(E55-E56,2)),0)","v":0},null," ",null,null," "]
["H","Cash Medical Support ",null,"Father","Mother","Combined",null,null," "," "]
[19,"Enter number of children in this case not covered by health insurance.  If none, skip to Line 24.  Note: This may be different from the number of children on Soonercare.",{"$f":"'Child Support Comp Entry'!B42","v":0},null,null,null,{"$f":"IF(ISNUMBER(C59),IF(C14>0,IF(C14<8,C14,C14-7),\"OUT\"),\"\")","v":"OUT"},{"$f":"IF(ISNUMBER(C59),IF(C14>0,IF(C14<8,C14,C14-7),\"OUT\"),\"\")","v":"OUT"}," "]
[20,"Enter the Soonercare or other health care government assistance applicant for the child(ren) in this case, if child(ren) are on SoonerCare.  Enter \"Father\", \"Mother\", \"other\", or leave blank.",{"$f":"'Child Support Comp Entry'!B43","v":""},null,null,null,{"$f":"IF(ISNUMBER(G59),IF(C14>7,'Cash Medical Table'!H8+(G59*792),IF(ISERROR(ROUNDUP(HLOOKUP(G59,'Cash Medical Table'!B6:H8,3,TRUE),0)),0,ROUNDUP(HLOOKUP(G59,'Cash Medical Table'!B6:H8,3,TRUE),0))))","v":false},{"$f":"IF(ISNUMBER(H59),IF(C14>7,'Cash Medical Table'!H8+(H59*792),IF(ISERROR(ROUNDUP(HLOOKUP(H59,'Cash Medical Table'!B6:H8,3,TRUE),0)),0,ROUNDUP(HLOOKUP(H59,'Cash Medical Table'!B6:H8,3,TRUE),0))))","v":false}," "]
[21,"Cash medical amount for obligor\nIf Line 19 is zero or the obligor is the person on Line 20, enter $0 in Line 23.  If Line 19 is greater than zero and the obligor is not the person on Line 20, refer to the Cash Medical Income Guidelines Table.  If the Obligor's income is less than or equal to the amount on the table, enter $0.  If greater, multiply $115 by the number of children in Line 19.  Multiply the combined total by percentage shares from Line 4.",null,{"$f":"IF(ISNUMBER(G61),(G61*D29),0)","v":0},{"$f":"IF(ISNUMBER(H61),(H61*E29),0)","v":0},{"$f":"IF(ISNUMBER(G61),G61,IF(ISNUMBER(H61),H61,0))","v":0},{"$f":"IF(C15=\"father\",IF(ISNUMBER(G59),IF(D21>G60,C59*115,0)))","v":false},{"$f":"IF(C15=\"mother\",IF(ISNUMBER(H59),IF(E21>H60,C59*115,0)))","v":false}]
[22,"5% of Gross Monthly Income\nLine 2 multiplied by 0.05 \nThis represents the maximum amount of total medical allowed.",null,{"$f":"IF(ISNUMBER(D18),D21*0.05,\"\")","v":0},{"$f":"IF(ISNUMBER(E18),E21*0.05,\"\")","v":0},null,null,null,null," "]
[23,"Cash medical support in lieu of insurance \nIf Line 21 plus Line 13 is greater than Line 22, use Line 22 minus \nLine 13.  If Line 21 plus Line 13 is less than or equal to Line 22, \nenter Line 21.  Enter $0 if negative ",null,{"$f":"IF(ISNUMBER(G59),IF(C60=C15,0,IF(C15=\"father\",IF(D46+D61>D62,IF(D62-D46>0,D62-D46,0),D61),0)),0)","v":0},{"$f":"IF(ISNUMBER(H59),IF(C60=C15,0,IF(C15=\"mother\",IF(E46+E61>E62,IF(E62-E46>0,E62-E46,0),E61),0)),0)","v":0}]
[]
["I","Current Monthly Support Obligation",null,"Father","Mother",null,null,null," "," "]
[24,"    a. Child support portion\n        If Line 14b is positive, Line 18 for obligor\n        If Line 14b is negative, reduce Line 18 by Line 14b\n        Enter $0 if negative",null,{"$f":"IF(C15=\"Father\",IF(D50>0,IF(D57>0,D57,0),IF(D57+D50>0,D57+D50,0)),\"\")","v":""},{"$f":"IF(C15=\"mother\",IF(E50>0,IF(E57>0,E57,0),IF(E57+E50>0,E57+E50,0)),\"\")","v":""}," ",null,null,null," "]
[" ","    b. Cash medical portion\n        If Line 18 minus 14b is positive, Line 23 for obligor \n        If Line 18 minus 14b is negative, reduce Line 23 by Line 18\n        minus 14b.  Enter $0 if negative ",null,{"$f":"IF(C15=\"Father\",IF(G67>0,D63,IF(D63+G67>0,D63+G67,0)),\"\")","v":""},{"$f":"IF(C15=\"mother\",IF(H67>0,E63,IF(E63+H67>0,E63+H67,0)),\"\")","v":""},null,{"$f":"IF(D57>0,D57-D50,D57+D50)","v":0},{"$f":"IF(E57>0,E57-E50,E57+E50)","v":0},null," "]
[" ","    c. Ongoing medical costs portion\n        If Line 18 is positive, Line 14b for obligor\n        If Line 18 is negative, reduce 14b by Line 18\n        Enter $0 if negative ",null,{"$f":"IF(C15=\"Father\",IF(D57>0,IF(D50>0,D50,0),IF(D57+D50>0,D57+D50,0)),\"\")","v":""},{"$f":"IF(C15=\"mother\",IF(E57>0,IF(E50>0,E50,0),IF(E57+E50>0,E57+E50,0)),\"\")","v":""},null,null,null,null," "]
[25,"Total obligation to be paid by the obligor\nLine 24a plus 24b plus 24c ",null,{"$f":"IF(C15=\"father\",SUM(D66:D68),\"\")","v":""},{"$f":"IF(C15=\"mother\",SUM(E66:E68),\"\")","v":""},null," "]
[null,null,null,null,null,null," "]
[{"$f":"(G71 & \" shall begin payments on \" & I71 & \" and continue on the same date of\")","v":"_____________________ shall begin payments on _____________________ and continue on the same date of"},null,null,null,null,null,{"$f":"IF('Names and Signature Lines'!B3>\"\",'Names and Signature Lines'!B3,\"_____________________\")","v":"_____________________"},null,{"$f":"IF('Names and Signature Lines'!B4>\"\",'Names and Signature Lines'!B4,\"_____________________\")","v":"_____________________"}]
["each month until further order of the court."]
[]
[{"$f":"'Names and Signature Lines'!B5","v":" "},"Guidelines were followed."]
[{"$f":"'Names and Signature Lines'!B6","v":" "},"Deviation from child support guidelines by Court-Specific findings of Court supporting each deviation:"]
[{"$f":"'Names and Signature Lines'!B7","v":"                                                                                              ____________________________________________________________________________________________\n                                                              ____________________________________________________________________________________________\n                                                                          ____________________________________________________________________________________________"},null,null,null,null,null,null,null,null," "]
[]
[]
[]
[]
[]
["Dated: ___________________________________",{"$f":"'Names and Signature Lines'!B8","v":" "}]
[null,"______________________________"]
[]
[null,null,null,"__________________________________"]
[null,null,null,"JUDGE"]
["APPROVED AS TO FORM:"]
[]
[]
[{"$f":"'Names and Signature Lines'!B9","v":" "}]
["___________________________________________",null,"______________________________________________"]
["Father printed name",null,"Father signature",null,null,null," "]
[]
[null," "]
[{"$f":"'Names and Signature Lines'!B10","v":" "},null," "]
["___________________________________________",null,"______________________________________________"]
["Attorney for father printed name",null,"Attorney for father signature and OBA Number"]
[]
[]
[{"$f":"'Names and Signature Lines'!B11","v":" "},null," "]
["___________________________________________",null,"______________________________________________"]
["Mother printed name",null,"Mother signature"]
[]
[]
[{"$f":"'Names and Signature Lines'!B12","v":" "},null," "]
["___________________________________________",null,"______________________________________________"]
["Attorney for mother printed name",null,"Attorney for mother signature and OBA Number"]
[]
[]
[{"$f":"'Names and Signature Lines'!B13","v":" "},null," "]
["___________________________________________",null,"______________________________________________"]
["Other Custodian printed name",null,"Other Custodian signature"]
[]
[]
[{"$f":"'Names and Signature Lines'!B14","v":" "},null," "]
["___________________________________________",null,"______________________________________________"]
["Attorney for Other Custodian printed name ",null,"Attorney for Other Custodian signature and "]
[null,null,"OBA Number"]
[]
[{"$f":"'Names and Signature Lines'!B15","v":" "},null," "]
["___________________________________________",null,"______________________________________________"]
["State's Attorney, CSS printed name",null,"State's Attorney, CSS signature and OBA Number",null,null,null," "]

{"sheet":"Insurance Premium Calculator","index":5,"n_rows":10,"n_cols":11,"rows_kept":10,"cut":false,"hidden":false,"merged":[[0,0,0,3],[0,8,0,11]]}
[" \n                                 INSURANCE PREMIUM WORKSHEET\nUse this form to compute the actual monthly premium for the children in the case.\n“Accessible” means there are available providers to meet the primary individual health care needs of the child(ren) no more than sixty (60) miles one way from the primary residence of the child(ren).  You may not wish to use the insurance premium amount if the coverage does not meet this standard.\n\nThis sheet is optional.  Use the Tab key to navigate to the entry fields.  Entry fields will have instructions on what to enter.",null,null,null,null,null,null,null," \n                                 INSURANCE PREMIUM WORKSHEET\nUse this form to compute the actual monthly premium for the children in the case.\n“Accessible” means there are available providers to meet the primary individual health care needs of the child(ren) no more than sixty (60) miles one way from the primary residence of the child(ren).  You may not wish to use the insurance premium amount if the coverage does not meet this standard.\n\nThis sheet is optional.  Use the Tab key to navigate to the entry fields.  Entry fields will have instructions on what to enter."]
["Info for calculation","Father","Mother","Other Custodian"]
["Enter the actual monthly health insurance premium cost paid by parent or other custodian for the adults and child(ren) in the household.",0,0,0]
["Enter cost of insurance for adults only ",0,0,0]
["Enter the number of dependent \nchildren being covered.  This \nincludes children on this case\nand other children covered on\nthe health insurance. ",0,0,0]
["Premium cost per child",{"$f":"'Insurance Premium'!D7","v":0},{"$f":"'Insurance Premium'!E7","v":0},{"$f":"'Insurance Premium'!F7","v":0},null,null,null,null,{"$f":"'Insurance Premium'!D7","v":0},{"$f":"'Insurance Premium'!E7","v":0},{"$f":"'Insurance Premium'!F7","v":0}]
["Enter the number of children on this order.  ",0,0,0]
["Monthly health insurance premium cost result",{"$f":"'Insurance Premium'!D9","v":0},{"$f":"'Insurance Premium'!E9","v":0},{"$f":"'Insurance Premium'!F9","v":0}," "," ",null,null,{"$f":"'Insurance Premium'!D9","v":0},{"$f":"'Insurance Premium'!E9","v":0},{"$f":"'Insurance Premium'!F9","v":0}]
["Monthly health insurance share for each parent",{"$f":"'Insurance Premium'!D10","v":0},{"$f":"'Insurance Premium'!E10","v":0},null," ",null,null,null,{"$f":"'Insurance Premium'!D10","v":0},{"$f":"'Insurance Premium'!E10","v":0}]
["5% of Gross Monthly Income \nmultiplied by 0.05 \nThis represents the maximum amount of total medical allowed.\n      Note:  Health insurance should\n      be reasonable in cost which \n      means the share of premium \n      for the parent\n      providing the coverage does not \n      exceed 5% of gross monthly \n      income.  If the share of premium for\n      the parent is greater \n      than 5% of gross monthly income, \n      parents may agree\n      to use premium cost \n      or must proceed to Section H. \n      Cash Medical Support. \n      If more than one parent has\n      insurance available, the court shall\n      give priority to the preference of the\n      custodial person unless not in best \n      interest of the child(ren).",{"$f":"'Insurance Premium'!D11","v":0},{"$f":"'Insurance Premium'!E11","v":0},null," ",null,null,null,{"$f":"'Insurance Premium'!D11","v":0},{"$f":"'Insurance Premium'!E11","v":0}]

{"sheet":"CS Schedule","index":6,"n_rows":298,"n_cols":8,"rows_kept":298,"cut":false,"hidden":true,"merged":[]}
["Eff. June 6, 2000",null,null,null,null,null,null,"43 O.S. § 119 "]
[null,null,null,null,"OKLAHOMA"]
[]
[null,null,null,null,"SCHEDULE OF BASIC CHILD SUPPORT OBLIGATIONS"]
["COMBINED"]
["GROSS"]
["MONTHLY",null,"ONE","TWO","THREE","FOUR","FIVE","SIX"]
["INCOME",null,"CHILD","CHILDREN","CHILDREN","CHILDREN","CHILDREN","CHILDREN"]
[0,null,50,50,50,50,50,50]
[600,null,50,50,50,50,50,50]
[650,null,50,50,50,88,118,141.37488333333329]
[700,null,50,50,101.30641333333337,122,154,175.85988333333336]
[750,null,61.147499999999944,107.32691666666662,131.50633333333329,156.18574999999996,198,207.04458333333326]
[800,null,94.042500000000004,140.58741666666668,165.13233333333335,190.17725000000002,239.22216666666665,241.76708333333332]
[850,null,126.9375,173.84791666666663,198.7583333333333,224.16874999999999,273.57916666666659,276.48958333333326]
[900,null,159.4725,206.74441666666672,232.01633333333339,257.78825000000006,307.5601666666667,310.83208333333334]
[950,null,191.98500000000001,239.61816666666661,265.25133333333326,291.38449999999995,341.51766666666657,345.15083333333325]
[1000,null,206.34898287116664,272.49191666666661,298.48633333333328,324.98074999999994,375.47516666666661,379.46958333333328]
[1050,null,215.02032118199998,305.36566666666664,331.72133333333329,358.57699999999994,409.43266666666659,413.78833333333324]
[1100,null,223.64765270094443,326.1057205956111,364.78766666666667,392.00274999999999,443.21783333333332,447.93291666666664]
[1150,null,232.11896013955555,338.43308588088883,397.25599999999997,424.82399999999996,476.39199999999994,481.46]
[1200,null,240.56226325605559,350.71969954538889,415.31553788366671,457.53675000000004,497.47325758781381,514.87625000000003]
[1250,null,249.00556637255556,363.00631320988884,429.84762904466669,474.98163009435672,514.88008702228285,550.92169311384259]
[1300,null,257.06411842875002,374.63089904433338,443.49104973175008,490.05760995358384,531.22244918968499,568.40802063296292]
[1350,null,264.85230487500002,385.79027613333335,456.50999927500004,504.44354919887508,546.81680733158066,585.0939838447913]
[1400,null,272.64049132125001,396.94965322233332,469.52894881825,518.82948844416626,562.41116547347633,601.77994705661968]
[1450,null,280.42867776750001,408.10903031133336,482.54789836150002,533.21542768945756,578.005523615372,618.46591026844806]
[1500,null,288.21686421375006,419.26840740033339,495.56684790475003,547.60136693474885,593.59988175726778,635.15187348027655]
[1550,null,296.00505066000005,430.42778448933336,508.58579744800005,561.98730618004004,609.19423989916345,651.83783669210493]
[1600,null,303.79323710625005,441.58716157833339,521.60474699125007,576.37324542533133,624.78859804105923,668.52379990393331]
[1650,null,311.58142355250004,452.74653866733337,534.62369653450003,590.75918467062252,640.3829561829549,685.20976311576169]
[1700,null,319.36960999875004,463.90591575633334,547.64264607774999,605.1451239159137,655.97731432485057,701.89572632759007]
[1750,null,327.15779644500003,475.06529284533337,560.66159562100006,619.53106316120511,671.57167246674635,718.58168953941856]
[1800,null,334.94598289125008,486.22466993433341,573.68054516425002,633.91700240649629,687.16603060864202,735.26765275124694]
[1850,null,342.73416933750002,497.38404702333338,586.69949470749998,648.30294165178748,702.76038875053769,751.95361596307532]
[1900,null,350.6029125,508.60987749999998,599.7257658333333,662.69717997916666,718.36423362075004,768.6481905658693]
[1950,null,358.49970000000002,519.85884250000004,612.75458583333329,677.09430747916667,733.97138112075004,785.34576306586928]
[2000,null,366.39648750000003,531.10780750000004,625.7834058333334,691.49143497916668,749.57852862075003,802.04333556586926]
[2050,null,374.29327500000005,542.35677250000003,638.81222583333329,705.88856247916669,765.18567612075003,818.74090806586923]
[2100,null,382.19006250000001,553.60573750000003,651.84104583333328,720.2856899791667,780.79282362075003,835.43848056586921]
[2150,null,390.08685000000003,564.85470250000003,664.86986583333328,734.68281747916672,796.39997112075002,852.13605306586919]
[2200,null,397.98363749999999,576.10366750000003,677.89868583333327,749.07994497916661,812.00711862075002,868.83362556586917]
[2250,null,405.88042500000006,587.35263250000003,690.92750583333338,763.47707247916674,827.61426612075002,885.53119806586938]
[2300,null,413.77721250000002,598.60159750000003,703.95632583333338,777.87419997916663,843.22141362075001,902.22877056586935]
[2350,null,421.67400000000004,609.85056250000002,716.98514583333326,792.27132747916664,858.82856112075001,918.92634306586933]
[2400,null,429.57078750000005,621.09952750000002,730.01396583333326,806.66845497916665,874.43570862075001,935.62391556586931]
[2450,null,437.46757500000001,632.34849250000002,743.04278583333326,821.06558247916666,890.04285612075,952.32148806586929]
[2500,null,444.52552750000001,642.685835,755.36146250000002,834.70277750000002,904.72418750000008,968.08221750000007]
[2550,null,451.38817,652.86548000000005,767.61995000000002,848.24867000000006,919.40975000000003,983.79489000000001]
[2600,null,458.25081249999999,663.04512499999998,779.87843750000002,861.79456249999998,934.09531249999998,999.50756249999995]
[2650,null,465.11345499999999,673.22477000000003,792.13692500000002,875.34045500000002,948.78087499999992,1015.220235]
[2700,null,471.77319349999999,683.10343899999998,804.03297250000003,888.48584349999999,963.03223749999995,1030.4683395]
[2750,null,477.36768600000005,691.40198400000008,814.02620999999999,899.52858600000002,975.00405000000001,1043.277462]
[2800,null,482.96217849999999,699.70052899999996,824.01944749999996,910.57132849999994,986.97586249999995,1056.0865844999998]
[2850,null,488.55667099999999,707.99907400000006,834.01268500000003,921.61407099999997,998.947675,1068.8957070000001]
[2900,null,494.15116350000005,716.29761900000005,844.00592250000011,932.65681350000011,1010.9194875000001,1081.7048295000002]
[2950,null,499.745656,724.59616400000004,853.99915999999996,943.69955600000003,1022.8913,1094.513952]
[3000,null,505.34014850000005,732.89470900000003,863.99239750000004,954.74229850000006,1034.8631125000002,1107.3230745000001]
[3050,null,510.93464099999994,741.19325399999991,873.985635,965.78504099999998,1046.8349249999999,1120.1321969999999]
[3100,null,516.52913349999994,749.49179900000001,883.97887249999997,976.82778350000001,1058.8067375000001,1132.9413195]
[3150,null,521.120318,756.35810600000002,892.02863000000002,985.7813000000001,1068.5041719999999,1143.1842020000001]
[3200,null,524.68462050000005,761.17837350000002,897.34784250000007,991.65967499999999,1074.875757,1150.0002494999999]
[3250,null,528.24892299999999,765.99864100000002,902.667055,997.53805000000011,1081.2473419999999,1156.8162970000001]
[3300,null,531.81322550000004,770.81890849999991,907.98626750000005,1003.416425,1087.618927,1163.6323445]
[3350,null,535.37752799999998,775.63917600000002,913.30547999999999,1009.2948,1093.9905120000001,1170.448392]
[3400,null,538.94183050000004,780.45944350000002,918.62469250000004,1015.1731750000001,1100.3620969999999,1177.2644395]
[3450,null,542.50613299999998,785.27971100000002,923.94390499999997,1021.05155,1106.733682,1184.0804869999999]
[3500,null,546.07043550000003,790.09997850000002,929.26311750000002,1026.9299250000001,1113.1052669999999,1190.8965344999999]
[3550,null,549.63473799999997,794.92024599999991,934.58232999999996,1032.8082999999999,1119.476852,1197.7125819999999]
[3600,null,553.19904050000002,799.74051350000002,939.90154250000001,1038.6866749999999,1125.8484369999999,1204.5286295000001]
[3650,null,556.76334300000008,804.56078100000002,945.22075500000005,1044.5650500000002,1132.220022,1211.344677]
[3700,null,560.32764550000002,809.38104849999991,950.53996749999999,1050.4434249999999,1138.5916070000001,1218.1607245]
[3750,null,563.89194800000007,814.20131600000002,955.85918000000004,1056.3218000000002,1144.9631919999999,1224.976772]
[3800,null,567.45625050000001,819.02158349999991,961.17839249999997,1062.2001749999999,1151.334777,1231.7928195]
[3850,null,571.02055300000006,823.84185100000002,966.49760500000002,1068.07855,1157.7063619999999,1238.6088669999999]
[3900,null,574.11606699469326,828.08244534114954,971.53838710130435,1073.5499177469414,1163.7281108376844,1245.1890785963224]
[3950,null,577.13549007312758,832.43572292780266,976.6375574402324,1079.1845009714568,1169.8359990530594,1251.7245189867735]
[4000,null,580.15491315156191,836.78900051445578,981.73672777916056,1084.8190841959724,1175.9438872684343,1258.2599593772247]
[4050,null,583.17433622999624,841.1422781011089,986.83589811808861,1090.453667420488,1182.051775483809,1264.7953997676757]
[4100,null,586.19375930843069,845.49555568776202,991.93506845701677,1096.0882506450037,1188.159663699184,1271.3308401581269]
[4150,null,589.21318238686501,849.84883327441514,997.03423879594493,1101.7228338695193,1194.2675519145589,1277.8662805485781]
[4200,null,592.23260546529934,854.20211086106826,1002.133409134873,1107.3574170940349,1200.3754401299338,1284.4017209390292]
[4250,null,595.25202854373379,858.55538844772138,1007.2325794738011,1112.9920003185505,1206.4833283453088,1290.9371613294802]
[4300,null,598.27145162216812,862.90866603437451,1012.3317498127292,1118.6265835430659,1212.5912165606835,1297.4726017199314]
[4350,null,601.29087470060244,867.26194362102763,1017.4309201516573,1124.2611667675817,1218.6991047760584,1304.0080421103826]
[4400,null,604.31029777903689,871.61522120768075,1022.5300904905855,1129.8957499920973,1224.8069929914334,1310.5434825008338]
[4450,null,607.32972085747122,875.96849879433387,1027.6292608295137,1135.5303332166127,1230.9148812068083,1317.0789228912849]
[4500,null,610.34914393590554,880.32177638098699,1032.7284311684416,1141.1649164411283,1237.022769422183,1323.6143632817359]
[4550,null,613.36856701433987,884.67505396764011,1037.8276015073698,1146.7994996656439,1243.130657637558,1330.1498036721871]
[4600,null,617.00936311533576,889.88924882983952,1043.9073527805604,1153.5176248225191,1250.413105307611,1337.9420226791437]
[4650,null,621.67325979062775,896.52095769256937,1051.6016461734778,1162.0198190216929,1259.6294838195151,1347.8035476868813]
[4700,null,626.33715646591963,903.15266655529933,1059.295939566395,1170.5220132208665,1268.8458623314193,1357.6650726946189]
[4750,null,631.0010531412114,909.78437541802919,1066.9902329593122,1179.0242074200401,1278.0622408433235,1367.5265977023562]
[4800,null,635.66494981650328,916.41608428075904,1074.6845263522293,1187.5264016192134,1287.2786193552274,1377.3881227100935]
[4850,null,640.32884649179516,923.04779314348889,1082.3788197451468,1196.028595818387,1296.4949978671318,1387.2496477178311]
[4900,null,644.99274316708716,929.67950200621885,1090.0731131380639,1204.5307900175608,1305.711376379036,1397.1111727255686]
[4950,null,649.65663984237892,936.31121086894871,1097.7674065309811,1213.0329842167341,1314.9277548909399,1406.9726977333059]
[5000,null,654.3205365176708,942.94291973167856,1105.4616999238985,1221.5351784159077,1324.1441334028443,1416.8342227410433]
[5050,null,658.98443319296268,949.57462859440841,1113.1559933168157,1230.0373726150813,1333.3605119147483,1426.6957477487808]
[5100,null,663.64832986825456,956.20633745713837,1120.8502867097329,1238.5395668142548,1342.5768904266524,1436.5572727565182]
[5150,null,668.31222654354656,962.83804631986834,1128.5445801026503,1247.0417610134284,1351.7932689385568,1446.4187977642557]
[5200,null,672.97612321883832,969.46975518259808,1136.2388734955675,1255.543955212602,1361.0096474504608,1456.280322771993]
[5250,null,677.58146705008119,976.01820632290139,1143.8365689592276,1263.9394086999464,1370.1103190307422,1466.0180413628941]
[5300,null,682.00139354183568,982.30300800885379,1151.1283709802399,1271.9968499331649,1378.8445853275512,1475.3637063004796]
[5350,null,685.62437017274658,987.49182746203746,1157.1531015289279,1278.6541771894654,1386.0611280733808,1483.0854070385174]
[5400,null,689.00972122811163,992.35385921922443,1162.8000309101119,1284.8940341556738,1392.8251330247506,1490.3228923364832]
[5450,null,692.39507228347657,997.2158909764114,1168.4469602912959,1291.133891121882,1399.5891379761204,1497.5603776344487]
[5500,null,695.78042333884162,1002.0779227335984,1174.0938896724799,1297.3737480880905,1406.3531429274901,1504.7978629324145]
[5550,null,699.16577439420666,1006.9399544907855,1179.7408190536642,1303.6136050542989,1413.1171478788601,1512.0353482303804]
[5600,null,702.5511254495716,1011.8019862479724,1185.3877484348479,1309.8534620205071,1419.8811528302297,1519.2728335283459]
[5650,null,705.93647650493665,1016.6640180051594,1191.0346778160322,1316.0933189867155,1426.6451577815997,1526.5103188263117]
[5700,null,709.32182756030159,1021.5260497623464,1196.681607197216,1322.3331759529237,1433.4091627329694,1533.7478041242773]
[5750,null,713.09336401664666,1026.9427199168574,1202.972712515168,1329.2848473292606,1440.9447745049185,1541.8109087202631]
[5800,null,716.86490047299162,1032.3593900713684,1209.2638178331201,1336.2365187055977,1448.4803862768679,1549.8740133162489]
[5850,null,720.63643692933658,1037.7760602258795,1215.5549231510722,1343.1881900819346,1456.0159980488172,1557.9371179122347]
[5900,null,724.40797338568166,1043.1927303803905,1221.8460284690241,1350.1398614582718,1463.5516098207663,1566.0002225082203]
[5950,null,728.17950984202662,1048.6094005349014,1228.1371337869762,1357.0915328346086,1471.0872215927157,1574.0633271042061]
[6000,null,731.95104629837158,1054.0260706894123,1234.4282391049283,1364.0432042109455,1478.6228333646648,1582.1264317001917]
[6050,null,735.96454901001675,1059.7807738896586,1241.1153334837836,1371.4324434995808,1486.6327687535456,1590.6970625662941]
[6100,null,740.87772625273169,1066.7923454145011,1249.2747871890886,1380.4486398439428,1496.4063255908343,1601.1547683821927]
[6150,null,745.79090349544674,1073.8039169393435,1257.4342408943937,1389.4648361883051,1506.1798824281227,1611.6124741980914]
[6200,null,750.70408073816168,1080.815488464186,1265.5936945996987,1398.4810325326669,1515.9534392654109,1622.0701800139898]
[6250,null,755.61725798087673,1087.8270599890284,1273.7531483050036,1407.4972288770289,1525.7269961026996,1632.5278858298884]
[6300,null,760.53043522359178,1094.838631513871,1281.9126020103085,1416.5134252213909,1535.500552939988,1642.9855916457871]
[6350,null,765.44361246630672,1101.8502030387133,1290.0720557156135,1425.5296215657529,1545.2741097772762,1653.4432974616857]
[6400,null,770.35678970902177,1108.8617745635561,1298.2315094209187,1434.5458179101151,1555.0476666145648,1663.9010032775843]
[6450,null,775.26996695173671,1115.8733460883984,1306.3909631262236,1443.5620142544769,1564.8212234518533,1674.358709093483]
[6500,null,780.18314419445187,1122.884917613241,1314.5504168315288,1452.5782105988392,1574.5947802891419,1684.8164149093816]
[6550,null,785.09632143716681,1129.8964891380833,1322.7098705368337,1461.5944069432012,1584.3683371264301,1695.2741207252802]
[6600,null,790.00949867988174,1136.9080606629259,1330.8693242421386,1470.610603287563,1594.1418939637185,1705.7318265411786]
[6650,null,794.9226759225968,1143.9196321877685,1339.0287779474438,1479.6267996319252,1603.9154508010072,1716.1895323570775]
[6700,null,799.83585316531185,1150.9312037126108,1347.1882316527485,1488.642995976287,1613.6890076382954,1726.6472381729759]
[6750,null,804.7490304080269,1157.9427752374534,1355.3476853580537,1497.6591923206493,1623.462564475584,1737.1049439888748]
[6800,null,809.66220765074183,1164.9543467622957,1363.5071390633586,1506.6753886650113,1633.2361213128725,1747.5626498047732]
[6850,null,814.57538489345677,1171.9659182871383,1371.6665927686636,1515.6915850093731,1643.0096781501607,1758.0203556206718]
[6900,null,819.48856213617182,1178.9774898119808,1379.8260464739687,1524.7077813537353,1652.7832349874493,1768.4780614365704]
[6950,null,824.40173937888687,1185.9890613368232,1387.9855001792737,1533.7239776980973,1662.5567918247375,1778.9357672524691]
[7000,null,829.31491662160192,1193.0006328616657,1396.1449538845789,1542.7401740424593,1672.3303486620262,1789.3934730683677]
[7050,null,834.22809386431686,1200.0122043865083,1404.3044075898838,1551.7563703868213,1682.1039054993146,1799.8511788842663]
[7100,null,838.45205492158073,1206.0892198698532,1411.4365387156352,1559.6373752807767,1690.6469148043623,1808.9921988406677]
[7150,null,842.1515034189041,1211.4550123841479,1417.786848973768,1566.6544681160137,1698.253443437759,1817.1311844784022]
[7200,null,845.85095191622725,1216.8208048984425,1424.1371592319008,1573.6715609512503,1705.8599720711554,1825.2701701161366]
[7250,null,849.55040041355062,1222.1865974127372,1430.4874694900336,1580.6886537864871,1713.4665007045521,1833.4091557538709]
[7300,null,853.24984891087377,1227.552389927032,1436.8377797481662,1587.7057466217236,1721.0730293379486,1841.5481413916052]
[7350,null,856.94929740819703,1232.9181824413265,1443.1880900062988,1594.7228394569602,1728.679557971345,1849.6871270293393]
[7400,null,860.64874590552029,1238.2839749556213,1449.5384002644319,1601.739932292197,1736.2860866047417,1857.8261126670739]
[7450,null,864.34819440284343,1243.6497674699158,1455.8887105225645,1608.7570251274335,1743.8926152381382,1865.9650983048082]
[7500,null,868.04764290016681,1249.0155599842105,1462.2390207806973,1615.7741179626705,1751.4991438715351,1874.1040839425425]
[7550,null,871.74709139748995,1254.3813524985051,1468.5893310388299,1622.7912107979071,1759.1056725049316,1882.2430695802768]
[7600,null,875.44653989481321,1259.7471450127996,1474.9396412969627,1629.8083036331436,1766.7122011383281,1890.3820552180111]
[7650,null,879.14598839213647,1265.1129375270943,1481.2899515550955,1636.8253964683804,1774.3187297717247,1898.5210408557455]
[7700,null,882.84543688945973,1270.4787300413889,1487.6402618132281,1643.842489303617,1781.9252584051212,1906.6600264934798]
[7750,null,886.54488538678299,1275.8445225556836,1493.9905720713609,1650.8595821388537,1789.5317870385179,1914.7990121312143]
[7800,null,890.24433388410614,1281.2103150699782,1500.3408823294935,1657.8766749740905,1797.1383156719144,1922.9379977689484]
[7850,null,893.9437823814294,1286.5761075842727,1506.6911925876263,1664.8937678093271,1804.7448443053108,1931.0769834066828]
[7900,null,897.64323087875266,1291.9419000985674,1513.0415028457592,1671.9108606445639,1812.3513729387075,1939.2159690444173]
[7950,null,901.34267937607592,1297.307692612862,1519.3918131038918,1678.9279534798004,1819.957901572104,1947.3549546821514]
[8000,null,905.04212787339918,1302.6734851271567,1525.7421233620246,1685.9450463150372,1827.5644302055007,1955.493940319886]
[8050,null,908.74157637072244,1308.0392776414512,1532.0924336201572,1692.9621391502737,1835.1709588388971,1963.63292595762]
[8100,null,912.44102486804559,1313.405070155746,1538.44274387829,1699.9792319855105,1842.7774874722936,1971.7719115953544]
[8150,null,916.14047336536885,1318.7708626700405,1544.7930541364228,1706.9963248207473,1850.3840161056903,1979.9108972330889]
[8200,null,919.83992186269211,1324.1366551843353,1551.1433643945554,1714.0134176559839,1857.9905447390868,1988.049882870823]
[8250,null,923.53937036001537,1329.50244769863,1557.4936746526882,1721.0305104912206,1865.5970733724835,1996.1888685085576]
[8300,null,927.23881885733863,1334.8682402129245,1563.8439849108208,1728.0476033264572,1873.2036020058799,2004.3278541462919]
[8350,null,930.93826735466178,1340.2340327272191,1570.1942951689537,1735.0646961616937,1880.8101306392764,2012.466839784026]
[8400,null,934.63771585198515,1345.5998252415138,1576.5446054270865,1742.0817889969305,1888.4166592726733,2020.6058254217605]
[8450,null,938.3371643493083,1350.9656177558084,1582.8949156852191,1749.0988818321673,1896.0231879060698,2028.7448110594946]
[8500,null,943.49691693472028,1357.0069921949969,1590.1439750628003,1757.1090924443945,1904.7062562097235,2038.0356941444043]
[8550,null,948.59728562006183,1363.0208938017495,1597.3564864170392,1765.0789174908284,1913.345546560058,2047.2797348192623]
[8600,null,953.69765430540338,1369.0347954085021,1604.5689977712782,1773.0487425372626,1921.9848369103925,2056.5237754941199]
[8650,null,958.79802299074504,1375.0486970152549,1611.7815091255172,1781.0185675836967,1930.6241272607272,2065.7678161689782]
[8700,null,963.89839167608659,1381.0625986220075,1618.9940204797563,1788.9883926301309,1939.2634176110619,2075.0118568438361]
[8750,null,968.99876036142825,1387.0765002287603,1626.2065318339955,1796.958217676565,1947.9027079613966,2084.2558975186944]
[8800,null,974.0991290467698,1393.0904018355129,1633.4190431882344,1804.9280427229992,1956.541998311731,2093.4999381935522]
[8850,null,979.19949773211124,1399.1043034422655,1640.6315545424734,1812.8978677694331,1965.1812886620655,2102.7439788684101]
[8900,null,984.2998664174529,1405.1182050490183,1647.8440658967124,1820.8676928158675,1973.8205790124002,2111.9880195432684]
[8950,null,989.40023510279445,1411.1321066557709,1655.0565772509515,1828.8375178623014,1982.4598693627347,2121.2320602181262]
[9000,null,994.50060378813612,1417.1460082625238,1662.2690886051905,1836.8073429087358,1991.0991597130694,2130.4761008929845]
[9050,null,999.60097247347767,1423.1599098692764,1669.4815999594296,1844.7771679551697,1999.7384500634039,2139.7201415678423]
[9100,null,1004.7013411588192,1429.173811476029,1676.6941113136686,1852.7469930016036,2008.3777404137384,2148.9641822427002]
[9150,null,1009.8017098441609,1435.1877130827818,1683.9066226679076,1860.716818048038,2017.0170307640731,2158.2082229175585]
[9200,null,1014.9020785295024,1441.2016146895344,1691.1191340221467,1868.6866430944719,2025.6563211144075,2167.4522635924163]
[9250,null,1020.0024472148441,1447.2155162962872,1698.3316453763857,1876.6564681409063,2034.2956114647425,2176.6963042672746]
[9300,null,1025.1028159001855,1453.2294179030398,1705.5441567306248,1884.6262931873403,2042.934901815077,2185.9403449421325]
[9350,null,1030.2031845855272,1459.2433195097924,1712.7566680848636,1892.5961182337744,2051.5741921654112,2195.1843856169903]
[9400,null,1035.3035532708689,1465.2572211165452,1719.9691794391028,1900.5659432802086,2060.2134825157459,2204.4284262918486]
[9450,null,1040.4039219562103,1471.2711227232978,1727.1816907933417,1908.5357683266427,2068.8527728660806,2213.6724669667065]
[9500,null,1045.504290641552,1477.2850243300506,1734.3942021475809,1916.5055933730769,2077.4920632164153,2222.9165076415647]
[9550,null,1050.6046593268936,1483.2989259368032,1741.60671350182,1924.475418419511,2086.13135356675,2232.1605483164226]
[9600,null,1055.7050280122351,1489.3128275435561,1748.8192248560588,1932.4452434659449,2094.7706439170843,2241.4045889912804]
[9650,null,1060.8053966975767,1495.3267291503089,1756.031736210298,1940.4150685123793,2103.409934267419,2250.6486296661387]
[9700,null,1065.9057653829184,1501.3406307570615,1763.2442475645369,1948.3848935588132,2112.0492246177537,2259.8926703409966]
[9750,null,1071.0061340682601,1507.3545323638141,1770.4567589187761,1956.3547186052476,2120.6885149680884,2269.1367110158544]
[9800,null,1076.1065027536015,1513.3684339705669,1777.6692702730152,1964.3245436516816,2129.3278053184226,2278.3807516907127]
[9850,null,1081.2068714389429,1519.3823355773195,1784.881781627254,1972.2943686981157,2137.9670956687573,2287.6247923655706]
[9900,null,1086.3072401242848,1525.3962371840723,1792.0942929814933,1980.2641937445499,2146.606386019092,2296.8688330404284]
[9950,null,1091.4076088096263,1531.4101387908249,1799.3068043357321,1988.234018790984,2155.2456763694263,2306.1128737152867]
[10000,null,1096.5079774949679,1537.4240403975778,1806.5193156899713,1996.2038438374182,2163.884966719761,2315.3569143901445]
[10050,null,1101.6083461803094,1543.4379420043304,1813.7318270442101,2004.1736688838523,2172.5242570700957,2324.6009550650024]
[10100,null,1106.708714865651,1549.4518436110829,1820.9443383984492,2012.1434939302862,2181.1635474204304,2333.8449957398607]
[10150,null,1111.8090835509927,1555.4657452178358,1828.1568497526882,2020.1133189767206,2189.8028377707651,2343.0890364147185]
[10200,null,1116.9094522363341,1561.4796468245884,1835.3693611069273,2028.0831440231545,2198.4421281210994,2352.3330770895764]
[10250,null,1122.0098209216758,1567.4935484313412,1842.5818724611665,2036.0529690695889,2207.0814184714341,2361.5771177644347]
[10300,null,1127.1101896070174,1573.5074500380938,1849.7943838154054,2044.0227941160229,2215.7207088217688,2370.8211584392925]
[10350,null,1132.2105582923589,1579.5213516448464,1857.0068951696444,2051.9926191624568,2224.359999172103,2380.0651991141503]
[10400,null,1137.3109269777005,1585.5352532515992,1864.2194065238834,2059.9624442088912,2232.9992895224377,2389.3092397890086]
[10450,null,1142.411295663042,1591.5491548583518,1871.4319178781225,2067.9322692553251,2241.6385798727724,2398.5532804638665]
[10500,null,1147.5116643483839,1597.5630564651046,1878.6444292323617,2075.9020943017595,2250.2778702231071,2407.7973211387248]
[10550,null,1152.6120330337253,1603.5769580718572,1885.8569405866006,2083.8719193481934,2258.9171605734414,2417.0413618135826]
[10600,null,1157.7124017190667,1609.5908596786098,1893.0694519408396,2091.8417443946273,2267.5564509237761,2426.2854024884405]
[10650,null,1162.8127704044086,1615.6047612853627,1900.2819632950786,2099.8115694410617,2276.1957412741108,2435.5294431632988]
[10700,null,1167.9131390897501,1621.6186628921153,1907.4944746493177,2107.7813944874956,2284.835031624445,2444.7734838381566]
[10750,null,1173.0135077750917,1627.6325644988681,1914.7069860035567,2115.75121953393,2293.4743219747802,2454.0175245130149]
[10800,null,1178.1138764604332,1633.6464661056207,1921.9194973577958,2123.7210445803639,2302.1136123251144,2463.2615651878727]
[10850,null,1183.2142451457748,1639.6603677123735,1929.1320087120348,2131.6908696267983,2310.7529026754491,2472.5056058627306]
[10900,null,1188.3146138311165,1645.6742693191261,1936.3445200662738,2139.6606946732322,2319.3921930257839,2481.7496465375889]
[10950,null,1193.4149825164579,1651.6881709258787,1943.5570314205129,2147.6305197196666,2328.0314833761181,2490.9936872124467]
[11000,null,1198.5153512017996,1657.7020725326315,1950.7695427747519,2155.6003447661005,2336.6707737264528,2500.2377278873046]
[11050,null,1203.6157198871413,1663.7159741393843,1957.982054128991,2163.5701698125349,2345.3100640767875,2509.4817685621629]
[11100,null,1208.7160885724827,1669.7298757461367,1965.1945654832298,2171.5399948589688,2353.9493544271218,2518.7258092370207]
[11150,null,1213.8164572578244,1675.7437773528895,1972.407076837469,2179.5098199054032,2362.5886447774565,2527.9698499118786]
[11200,null,1218.9416067005388,1681.774859615999,1979.641305954246,2187.5036430794416,2371.2539490981148,2537.2417255349828]
[11250,null,1221.1378304976045,1685.7752991406842,1984.3086356536141,2192.6610423972434,2376.8445699586118,2543.2236898557144]
[11300,null,1223.1672065743314,1689.471824184551,1988.6213870438642,2197.42663268347,2382.010469828881,2548.7512027169028]
[11350,null,1225.1820741536376,1693.1419218822596,1992.9033055376692,2202.1581526191244,2387.1394374391307,2554.23919805987]
[11400,null,1227.1969417329437,1696.8120195799681,1997.185224031474,2206.8896725547788,2392.2684050493799,2559.7271934028367]
[11450,null,1229.2118093122499,1700.4821172776769,2001.4671425252791,2211.6211924904333,2397.3973726596296,2565.2151887458035]
[11500,null,1231.2266768915561,1704.1522149753855,2005.7490610190841,2216.3527124260881,2402.5263402698793,2570.7031840887707]
[11550,null,1233.2415444708622,1707.8223126730941,2010.0309795128892,2221.0842323617426,2407.6553078801285,2576.1911794317375]
[11600,null,1235.2564120501684,1711.4924103708029,2014.3128980066942,2225.815752297397,2412.7842754903781,2581.6791747747047]
[11650,null,1237.2712796294745,1715.1625080685114,2018.5948165004991,2230.5472722330514,2417.9132431006278,2587.1671701176715]
[11700,null,1239.2861472087807,1718.8326057662202,2022.8767349943043,2235.2787921687063,2423.042210710877,2592.6551654606387]
[11750,null,1241.3010147880868,1722.5027034639288,2027.1586534881092,2240.0103121043608,2428.1711783211267,2598.1431608036055]
[11800,null,1243.315882367393,1726.1728011616376,2031.4405719819142,2244.7418320400152,2433.3001459313764,2603.6311561465727]
[11850,null,1245.3307499466991,1729.8428988593462,2035.7224904757193,2249.4733519756696,2438.4291135416256,2609.1191514895395]
[11900,null,1247.3456175260053,1733.5129965570547,2040.0044089695243,2254.2048719113241,2443.5580811518753,2614.6071468325067]
[11950,null,1249.3604851053115,1737.1830942547633,2044.2863274633291,2258.9363918469785,2448.6870487621245,2620.0951421754735]
[12000,null,1251.3753526846176,1740.8531919524721,2048.5682459571344,2263.6679117826334,2453.8160163723742,2625.5831375184407]
[12050,null,1253.3902202639238,1744.5232896501807,2052.8501644509392,2268.3994317182878,2458.9449839826239,2631.0711328614075]
[12100,null,1255.4050878432301,1748.1933873478893,2057.1320829447445,2273.1309516539422,2464.0739515928735,2636.5591282043747]
[12150,null,1257.4199554225363,1751.8634850455981,2061.4140014385493,2277.8624715895971,2469.2029192031227,2642.0471235473415]
[12200,null,1259.4348230018425,1755.5335827433066,2065.6959199323542,2282.5939915252516,2474.3318868133724,2647.5351188903087]
[12250,null,1261.4496905811486,1759.2036804410152,2069.9778384261595,2287.325511460906,2479.4608544236221,2653.0231142332755]
[12300,null,1263.4645581604548,1762.873778138724,2074.2597569199643,2292.0570313965609,2484.5898220338718,2658.5111095762427]
[12350,null,1265.4794257397609,1766.5438758364326,2078.5416754137696,2296.7885513322153,2489.718789644121,2663.9991049192095]
[12400,null,1267.4942933190671,1770.2139735341411,2082.8235939075744,2301.5200712678698,2494.8477572543707,2669.4871002621762]
[12450,null,1269.5091608983732,1773.8840712318497,2087.1055124013792,2306.2515912035242,2499.9767248646199,2674.9750956051435]
[12500,null,1271.5240284776794,1777.5541689295585,2091.3874308951845,2310.9831111391786,2505.1056924748696,2680.4630909481102]
[12550,null,1273.5388960569855,1781.2242666272671,2095.6693493889893,2315.7146310748331,2510.2346600851188,2685.9510862910774]
[12600,null,1275.5537636362917,1784.8943643249756,2099.9512678827941,2320.4461510104875,2515.3636276953685,2691.4390816340442]
[12650,null,1277.5686312155979,1788.5644620226844,2104.2331863765994,2325.1776709461424,2520.4925953056181,2696.9270769770114]
[12700,null,1279.583498794904,1792.234559720393,2108.5151048704042,2329.9091908817968,2525.6215629158673,2702.4150723199782]
[12750,null,1281.5983663742102,1795.9046574181018,2112.7970233642095,2334.6407108174517,2530.750530526117,2707.9030676629454]
[12800,null,1283.6132339535163,1799.5747551158104,2117.0789418580143,2339.3722307531061,2535.8794981363667,2713.3910630059122]
[12850,null,1285.6281015328225,1803.2448528135192,2121.3608603518196,2344.1037506887606,2541.0084657466164,2718.8790583488794]
[12900,null,1287.6429691121286,1806.9149505112277,2125.6427788456244,2348.835270624415,2546.1374333568656,2724.3670536918462]
[12950,null,1289.6578366914348,1810.5850482089363,2129.9246973394293,2353.5667905600694,2551.2664009671153,2729.8550490348134]
[13000,null,1291.6727042707412,1814.2551459066449,2134.2066158332345,2358.2983104957243,2556.3953685773649,2735.3430443777802]
[13050,null,1293.6875718500471,1817.9252436043537,2138.4885343270394,2363.0298304313787,2561.5243361876142,2740.8310397207474]
[13100,null,1295.7024394293533,1821.5953413020623,2142.7704528208442,2367.7613503670332,2566.6533037978638,2746.3190350637142]
[13150,null,1297.7173070086596,1825.2654389997708,2147.0523713146495,2372.4928703026876,2571.782271408113,2751.8070304066814]
[13200,null,1299.7321745879658,1828.9355366974796,2151.3342898084543,2377.224390238342,2576.9112390183627,2757.2950257496482]
[13250,null,1301.747042167272,1832.6056343951882,2155.6162083022596,2381.9559101739969,2582.0402066286124,2762.7830210926149]
[13300,null,1303.7619097465781,1836.275732092897,2159.8981267960644,2386.6874301096514,2587.1691742388621,2768.2710164355822]
[13350,null,1305.7767773258843,1839.9458297906056,2164.1800452898697,2391.4189500453058,2592.2981418491113,2773.7590117785494]
[13400,null,1307.7916449051904,1843.6159274883141,2168.4619637836745,2396.1504699809602,2597.427109459361,2779.2470071215162]
[13450,null,1309.8065124844966,1847.2860251860227,2172.7438822774793,2400.8819899166151,2602.5560770696102,2784.7350024644829]
[13500,null,1311.8213800638027,1850.9561228837313,2177.0258007712846,2405.6135098522695,2607.6850446798599,2790.2229978074502]
[13550,null,1313.8362476431089,1854.6262205814403,2181.3077192650899,2410.3450297879244,2612.8140122901095,2795.7109931504174]
[13600,null,1315.851115222415,1858.2963182791486,2185.5896377588942,2415.0765497235784,2617.9429799003588,2801.1989884933837]
[13650,null,1317.8659828017212,1861.9664159768574,2189.8715562526995,2419.8080696592333,2623.0719475106084,2806.6869838363509]
[13700,null,1319.8808503810274,1865.636513674566,2194.1534747465043,2424.5395895948877,2628.2009151208581,2812.1749791793181]
[13750,null,1321.8957179603335,1869.3066113722746,2198.4353932403096,2429.2711095305422,2633.3298827311073,2817.6629745222849]
[13800,null,1323.9105855396397,1872.9767090699834,2202.7173117341149,2434.002629466197,2638.458850341357,2823.1509698652521]
[13850,null,1325.9254531189458,1876.6468067676919,2206.9992302279197,2438.7341494018515,2643.5878179516067,2828.6389652082189]
[13900,null,1327.940320698252,1880.3169044654007,2211.2811487217245,2443.4656693375059,2648.7167855618563,2834.1269605511861]
[13950,null,1329.9551882775581,1883.9870021631093,2215.5630672155294,2448.1971892731603,2653.8457531721056,2839.6149558941529]
[14000,null,1331.9700558568643,1887.6570998608179,2219.8449857093347,2452.9287092088148,2658.9747207823548,2845.1029512371197]
[14050,null,1333.9849234361707,1891.3271975585267,2224.1269042031399,2457.6602291444697,2664.1036883926049,2850.5909465800869]
[14100,null,1335.9997910154766,1894.997295256235,2228.4088226969443,2462.3917490801236,2669.2326560028541,2856.0789419230537]
[14150,null,1338.014658594783,1898.6673929539438,2232.6907411907496,2467.1232690157785,2674.3616236131038,2861.5669372660209]
[14200,null,1340.0295261740891,1902.3374906516524,2236.9726596845549,2471.854788951433,2679.490591223353,2867.0549326089877]
[14250,null,1342.0443937533951,1906.0075883493612,2241.2545781783597,2476.5863088870874,2684.6195588336027,2872.5429279519549]
[14300,null,1344.0592613327015,1909.67768604707,2245.536496672165,2481.3178288227423,2689.7485264438524,2878.0309232949221]
[14350,null,1346.0741289120076,1913.3477837447786,2249.8184151659698,2486.0493487583967,2694.877494054102,2883.5189186378889]
[14400,null,1348.0889964913138,1917.0178814424871,2254.1003336597746,2490.7808686940512,2700.0064616643513,2889.0069139808561]
[14450,null,1350.1038640706199,1920.6879791401957,2258.3822521535794,2495.5123886297056,2705.1354292746009,2894.4949093238229]
[14500,null,1352.1187316499261,1924.3580768379043,2262.6641706473847,2500.2439085653605,2710.2643968848502,2899.9829046667896]
[14550,null,1354.1335992292322,1928.0281745356133,2266.94608914119,2504.9754285010149,2715.3933644950998,2905.4709000097569]
[14600,null,1356.1484668085384,1931.6982722333216,2271.2280076349944,2509.7069484366693,2720.5223321053491,2910.9588953527236]
[14650,null,1358.1633343878445,1935.3683699310304,2275.5099261287996,2514.4384683723238,2725.6512997155987,2916.4468906956909]
[14700,null,1360.1782019671509,1939.0384676287392,2279.7918446226049,2519.1699883079787,2730.7802673258489,2921.9348860386581]
[14750,null,1362.1930695464569,1942.7085653264476,2284.0737631164097,2523.9015082436331,2735.9092349360981,2927.4228813816248]
[14800,null,1364.2079371257632,1946.3786630241564,2288.355681610215,2528.6330281792875,2741.0382025463477,2932.9108767245921]
[14850,null,1366.2228047050694,1950.0487607218649,2292.6376001040198,2533.3645481149424,2746.167170156597,2938.3988720675588]
[14900,null,1368.2376722843753,1953.7188584195737,2296.9195185978247,2538.0960680505968,2751.2961377668466,2943.8868674105256]
[14950,null,1370.2525398636815,1957.3889561172823,2301.2014370916299,2542.8275879862513,2756.4251053770959,2949.3748627534928]
[15000,null,1372.2674074429879,1961.0590538149911,2305.4833555854348,2547.5591079219057,2761.5540729873455,2954.8628580964601]

{"sheet":"Insurance Premium","index":7,"n_rows":11,"n_cols":9,"rows_kept":11,"cut":false,"hidden":true,"merged":[[9,5,10,5],[9,1,9,2],[10,1,10,2],[6,1,6,2],[7,1,7,2],[0,0,0,5],[4,1,4,2],[5,1,5,2],[8,1,8,2],[1,0,1,5],[2,1,2,2],[3,1,3,2]]}
["Insurance Premium WorksheetA1:F11"]
["Use this form to compute the actual monthly premium for the children in the case.\n“Accessible” means there are available providers to meet the primary individual health care needs of the child(ren) no more than sixty (60) miles one way from the primary residence of the child(ren).  You may not wish to use the insurance premium amount if the coverage does not meet this standard."]
[" "," ",null,"Father","Mother","Other Custodian"]
[null,"  11a. The actual monthly health\n         premium cost paid by parent or \n         other custodian for the adults\n         and child(ren) in the household. ",null,{"$f":"'Insurance Premium Calculator'!B3","v":0},{"$f":"'Insurance Premium Calculator'!C3","v":0},{"$f":"'Insurance Premium Calculator'!D3","v":0}]
[null,"  11b. Cost of insurance for adults only ",null,{"$f":"'Insurance Premium Calculator'!B4","v":0},{"$f":"'Insurance Premium Calculator'!C4","v":0},{"$f":"'Insurance Premium Calculator'!D4","v":0}]
[null,"  11c. The number of dependent \n         children being covered. This \n         includes children on this case\n         and other children covered on\n         the health insurance. ",null,{"$f":"'Insurance Premium Calculator'!B5","v":0},{"$f":"'Insurance Premium Calculator'!C5","v":0},{"$f":"'Insurance Premium Calculator'!D5","v":0}]
[null,"  11d. Premium cost per child\n         Line a minus b, divided by\n         Line c  ",null,{"$f":"IF(ISNUMBER(D6),IF(D6>0,ROUND((D4-D5)/D6,2),0),0)","v":0},{"$f":"IF(ISNUMBER(E6),IF(E6>0,ROUND((E4-E5)/E6,2),0),0)","v":0},{"$f":"IF(ISNUMBER(F6),IF(F6>0,ROUND((F4-F5)/F6,2),0),0)","v":0}]
[null,"  11e. The number of children on\n         this order.  ",null,{"$f":"'Insurance Premium Calculator'!B7","v":0},{"$f":"'Insurance Premium Calculator'!C7","v":0},{"$f":"'Insurance Premium Calculator'!D7","v":0}]
[11,"Monthly health insurance premium costs\nLine 11d multiplied by Line 11e",null,{"$f":"IF(ISNUMBER(D8),IF(D8>0,D8*D7,'Child Support Computation'!D44),'Child Support Computation'!D44)","v":0},{"$f":"IF(ISNUMBER(E8),IF(E8>0,E8*E7,'Child Support Computation'!E44),'Child Support Computation'!E44)","v":0},{"$f":"IF(ISNUMBER(F8),IF(F8>0,F8*F7,'Child Support Computation'!F44),'Child Support Computation'!F44)","v":0},null,{"$f":"SUM(D9:F9)","v":0}," "]
[12,"Monthly health insurance share for each parent\nPercentage share of income in Line 4 multiplied by total current insurance cost for all persons in Line 11",null,{"$f":"IF(ISERROR('Child Support Computation'!D29*$H9),0,ROUND('Child Support Computation'!D29*$H9,2))","v":0},{"$f":"IF(ISERROR('Child Support Computation'!E29*$H9),0,ROUND('Child Support Computation'!E29*$H9,2))","v":0},null," "," "]
[22,"5% of Gross Monthly Income \nLine 2 of Comp. Form multiplied by 0.05 \nThis represents the maximum amount of total medical allowed.\n      Note:  Health insurance should\n      be reasonable in cost which \n      means the share of premium \n      shown on Line 12 for the parent\n      providing the coverage does not \n      exceed 5% of gross monthly \n      income.  If Line 12 is greater \n      than Line 22, parents may \n      agree to use premium cost \n      or must proceed to Section H. \n      Cash Medical Support. \n      If more than one parent has\n      insurance available, the court shall\n      give priority to the preference of the\n      custodial person unless not in best \n      interest of the child(ren).",null,{"$f":"'Child Support Computation'!D21*0.05","v":0},{"$f":"'Child Support Computation'!E21*0.05","v":0},null," "," "]

{"sheet":"Cash Medical Table","index":8,"n_rows":13,"n_cols":9,"rows_kept":13,"cut":false,"hidden":false,"merged":[[4,9,4,19],[5,7,6,7],[5,8,6,8],[10,8,11,8],[10,4,11,4],[10,5,11,5],[10,6,11,6],[10,7,11,7],[1,3,1,5],[5,4,6,4],[5,5,6,5],[5,6,6,6],[4,0,4,8],[5,1,6,1],[3,1,3,7],[5,0,6,0],[5,2,6,2],[5,3,6,3],[10,0,11,0],[10,1,11,1],[10,2,11,2],[10,3,11,3],[9,0,9,8]]}
[]
[null,null,null," "]
[]
[null,"OKLAHOMA CASH MEDICAL INCOME GUIDELINES TABLE "]
["             OKLAHOMA CASH MEDICAL INCOME GUIDELINES TABLE         Eff. March 1, 2023\nThe following table reflects 185% of the Federal Poverty Guidelines as of January, 2023.  If the Obligor's income as shown on the Child Support Computation and the total number of children in the case is at or below the amounts on the table, cash medical support will be established at $0.00.  If the Obligor's income exceeds the amount listed on the table for the number of children, the cash medical support obligation will be $115.00 per child for the children not covered by health insurance, pro rated by the income of the parents.  The obligor's share of the cash medical order should not exceed 5% of the gross income of the obligor.  "]
["Number of\nchildren",1,2,3,4,5,6,7,"8 or more"]
[]
["Income\nof the\nObligor",3040,3833,4625,5417,6210,7002,7795,"For each child over 7, add $792 per child"]
[]
["             OKLAHOMA CASH MEDICAL INCOME GUIDELINES TABLE        Eff. Sept 15, 2015\nThe following table reflects 185% of the Federal Poverty Guidelines as of April 1, 2009.  If the combined income of the parents as shown on the Child Support Computation and the total number of children in the case being considered is at or below the amounts on the table, cash medical support will be established at $0.00.  If the combined income exceeds the amount listed on the table for the number of children, the cash medical support obligation will be $115.00 per child for the children not covered by health insurance, pro rated by the income of the parents.  The obligor's share of the cash medical order should not exceed 5% of the gross income of the obligor.  "]
["Number of\nchildren",1,2,3,4,5,6,7,"8 or more"]
[]
["Income\nof the\nObligor",2425,3051,3677,4303,4929,5555,6181,"For each child over 7, add $626 per month"]

{"sheet":"RSO","index":9,"n_rows":1,"n_cols":2,"rows_kept":1,"cut":false,"hidden":true,"merged":[]}
["Current support should be set at $ ______per month plus cash medical in the amount of $_____ per month making a total monthly amount of $______. Deviation should be granted in the best interest of the children who are impacted by this order, allowing for equitable allocation of funds available for support of all __ children in __ cases. Child support amount was calculated by a child support guidelines which uses the non-custodial parent's gross monthly income and the average of __ biological parents’ gross monthly income (plus daycare and or/ private medical costs if applicable) and the total number of children in these cases for an equitable distribution for all children involved in these proceedings.","                                                                                              _____________________________________________________________________________________________\n                                                              _____________________________________________________________________________________________ \n                                                                          _____________________________________________________________________________________________"]

{"sheet":"Storage","index":10,"n_rows":7,"n_cols":6,"rows_kept":7,"cut":false,"hidden":true,"merged":[]}
["continue"]
[{"$f":"'Child Support Computation'!C15","v":""}]
[{"$f":"'Child Support Computation'!D32","v":0},{"$f":"'Child Support Computation'!E32","v":365}]
[{"$f":"IF(SUM(A3)<0,0,SUM(A3))","v":0},{"$f":"IF(SUM(B3)<0,0,SUM(B3))","v":365}]
[{"$f":"IF(A2=\"father\",A4,IF(A2=\"mother\",B4,0))","v":0}]
[]
[null,null,null,null,null,"                                                                                              _____________________________________________________________________________________________\n                                                              _____________________________________________________________________________________________ \n                                                                          _____________________________________________________________________________________________"]

{"sheet":"Sheet1","index":11,"n_rows":0,"n_cols":0,"rows_kept":0,"cut":false,"hidden":true,"merged":[]}

{"sheet":"Sheet2","index":12,"n_rows":0,"n_cols":0,"rows_kept":0,"cut":false,"hidden":true,"merged":[]}