{"text_format":"1","workbook":"xlsx","n_sheets":13,"sheets":["Blank Insurance Premium","Child Support Comp Entry","Legal Styling","Names and Signature Lines","Child Support Computation","Insurance Premium Calculator","CS Schedule","Insurance Premium","Cash Medical Table","RSO","Storage","Sheet1","Sheet2"],"not_rendered":{"charts":0,"images":2,"macros":1,"external_links":0,"defined_names":30,"comments":0,"pivot_tables":0},"unopened":[],"bounds":{"document_bytes":16777216,"sheet_cells":100000,"rows_first":2000,"rows_last":500,"rows_between":2000,"halvings":0,"cell_chars":16384,"cell_head_chars":4096},"cells_cut":0,"cells_raw":0,"read":"whole","date_system":"1900"}

{"sheet":"Blank Insurance Premium","index":0,"n_rows":1,"n_cols":1,"rows_kept":1,"cut":false,"hidden":true,"merged":[]}
[" "]

{"sheet":"Child Support Comp Entry","index":1,"n_rows":55,"n_cols":14,"rows_kept":55,"cut":false,"hidden":false,"merged":[[0,0,0,4],[2,8,2,12]]}
["\nCHILD SUPPORT COMPUTATION\n\nUse the Tab key to navigate to entry fields.  Each entry field will provide instructions on what to enter and whether or not it is required.  The Tab navigation will not include Column A.  Column B allows for entry of number of children or responsible person only when applicable.  Column C used for the Father's information when available.  Column D is used for the Mother's information when available.  Column E is for entry of Other custodian's information when applicable.  To reset and initialize this form for entry of a new calculation, press control r.  To print the legal style of this form, press control p.  \n"]
["Description of information or instruction","Info for calculation","Father","Mother","Other Custodian"]
["Press Reset button or Control-r to reset calculations",null,null,null,null,null," ",null,"\nCHILD SUPPORT COMPUTATION\n\nUse the Tab key to navigate to entry fields.  Each entry field will provide instructions on what to enter and whether or not it is required.  The Tab navigation will not include Column A.  Column B allows for entry of number of children or responsible person only when applicable.  Column C used for the Father's information when available.  Column D is used for the Mother's information when available.  Column E is for entry of Other custodian's information when applicable.  To reset and initialize this form for entry of a new calculation, press control r.  To print the legal style of this form, press control p.  \n"]
["Enter the number of children in this case",0,null,null,null,null," "]
["Enter gross monthly income\nAll sources, except income specifically excluded by 43 O.S. Section 118B(B)",null,0,0,null,null," "," "]
["Enter the amount of self-employment income included in the gross monthly income ",null,0,0,null," "," "," "]
["Deduction for self-employment tax",null,{"$f":"'Child Support Computation'!D20","v":0},{"$f":"'Child Support Computation'!E20","v":0},null,null,4]
["Gross monthly income less any self-employment tax*",null,{"$f":"'Child Support Computation'!D21","v":0},{"$f":"'Child Support Computation'!E21","v":0},null," ",5]
["Enter the amount of S.S.A. Title II benefits or veterans disability benefits paid for the benefit of the children.  Do NOT include S.S.I. benefits. (Enter in the column for the disabled or retired parent.)",null,0,0,null,null," "]
["Enter the court ordered support alimony actually paid in a prior case",null,0,0,null,null," "]
["Enter the court ordered monthly adjustment for marital debt",null,0,0,null,null," "," "," "]
["Enter the court ordered monthly child support actually paid for qualified out-of-home children",null,0,0,null,null," ","Father"]
["Enter the number of qualified in-home children excluding children on this case  ",null,0,0,null," "," ","Mother",null," "," "]
["Calculated amount of deduction for qualified in-home children using the number of qualified in-home children",null,{"$f":"'Child Support Computation'!D27","v":0},{"$f":"'Child Support Computation'!E27","v":0},null," ",11]
["Calculated adjusted gross monthly income* ",null,{"$f":"'Child Support Computation'!D28","v":0},{"$f":"'Child Support Computation'!E28","v":0}," ",null,12," "]
["Calculated percentage share of income\n",null,{"$f":"'Child Support Computation'!D29","v":0},{"$f":"'Child Support Computation'!E29","v":0}," ",null," "]
["Calculated base monthly obligation*  ",null,{"$f":"'Child Support Computation'!D30","v":0},{"$f":"'Child Support Computation'!E30","v":0}," ",null," "]
["Parenting time adjustment, if used",null,"Father","Mother","Combined"]
["Enter number of overnights for each parent\nIf less than 121 for either parent, skip this entry.",{"$f":"IF(SUM(C19:D19)>0,IF(SUM(C19:D19)=365,\"\",\"Combined must = 365 >>\"),\"\")","v":""},0,365," ",null," ","Other"]
["Calculated percentage of overnights with each parent ",null,{"$f":"'Child Support Computation'!D33","v":0},{"$f":"'Child Support Computation'!E33","v":1}," ",null," "]
{"$rows_left_out":36}
{"sheet":"Legal Styling","index":2,"n_rows":80,"n_cols":5,"rows_kept":80,"cut":false,"hidden":false,"merged":[[0,0,0,1]]}
["CHILD SUPPORT COMPUTATION LEGAL STYLE (OPTIONAL)",null,null,null," "]
["Description of information or instruction","Information for legal style",null,null,"ADMINISTRATIVE REVIEW"]
["Enter District Court County","Administrative Review",null,null,"ADAIR"]
["Enter Style Line 1"," ",null,null,"ALFALFA  "]
["Enter Style Line 2"," ",null,null,"ATOKA    "]
["Enter Style Line 3"," ",null,null,"BEAVER   "]
["Enter Style Line 4"," ",null,null,"BECKHAM  "]
["Enter Style Line 5"," ",null,null,"BLAINE   "]
["Enter District Court Case Number"," ",null,null,"BRYAN    "]
["Enter O.A.H. Case Number"," ",null,null,"CADDO    "]
["Enter Family Group Number"," ",null,null,"CANADIAN "]
[null,null,null,null,"CARTER   "]
[null,null,null,null,"CHOCTAW   "]
[null,null,null,null,"CIMARRON  "]
[null,null,null,null,"CLEVELAND "]
[null,null,null,null,"COAL      "]
[null,null,null,null,"COMANCHE  "]
[null,null,null,null,"COTTON    "]
[null,null,null,null,"CRAIG     "]
[null,null,null,null,"CREEK     "]
{"$rows_left_out":61}
{"sheet":"Names and Signature Lines","index":3,"n_rows":15,"n_cols":2,"rows_kept":15,"cut":false,"hidden":false,"merged":[[0,0,0,1]]}
["\nCHILD SUPPORT COMPUTATION NAMES AND SIGNATURE LINES (OPTIONAL)\n\nEntry information will print exactly as entered on the guideline."]
["Description of information or instruction","Information for legal style"]
["Enter who should begin payments"]
["Enter the date payments begin"]
["Were guidelines followed?"," "]
["Was there a deviation from child support guidelines by Court-Specific findings of Court supporting each deviation?"," "]
["Enter deviation description ","                                                                                              ____________________________________________________________________________________________\n                                                              ____________________________________________________________________________________________\n                                                                          ____________________________________________________________________________________________"]
["Enter the date"," "]
["Enter the Father's name"," "]
["Enter the Father's attorney's name"," "]
["Enter the Mother's name"," "]
["Enter the Mother's attorney's name"," "]
["Enter the name of Other custodian"," "]
["Enter the name of Other custodian's attorney"," "]
["Enter the State's attorney, CSS"," "]

{"sheet":"Child Support Computation","index":4,"n_rows":122,"n_cols":15,"rows_kept":122,"cut":false,"hidden":true,"merged":[[86,0,86,5],[90,0,90,1],[89,2,89,5],[94,2,94,5],[106,2,106,5],[101,2,101,5],[95,0,95,1],[95,2,95,5],[100,0,100,1],[90,2,90,5],[85,3,85,5],[85,0,85,2],[121,2,121,5],[114,0,114,1],[114,2,114,5],[119,0,119,1],[119,2,119,5],[120,0,120,1],[120,2,120,5],[115,0,115,1],[115,2,115,5],[111,2,111,5],[89,0,89,1],[91,2,91,5],[104,0,104,1],[104,2,104,5],[94,0,94,1],[100,2,100,5],[105,0,105,1],[105,2,105,5],[110,0,110,1],[110,2,110,5],[109,0,109,1],[109,2,109,5],[7,4,7,5],[19,1,19,2],[14,3,15,5],[24,1,24,2],[23,1,23,2],[25,1,25,2],[30,1,30,2],[96,2,96,5],[99,0,99,1],[99,2,99,5],[74,1,74,5],[83,0,83,2],[78,0,78,5],[84,3,84,5],[83,3,83,5],[77,0,77,5],[25,0,26,0],[27,1,27,2],[22,0,24,0],[28,1,28,2],[29,1,29,2],[39,1,39,2],[25,5,26,5],[26,1,26,2],[3,4,3,5],[4,0,4,1],[4,2,4,3],[4,4,4,5],[3,0,3,1],[3,2,3,3],[20,1,20,2],[5,0,5,1],[5,2,5,3],[6,0,6,1],[7,0,7,1],[6,2,6,3],[7,2,7,3],[18,5,24,5],[8,0,8,5],[16,1,16,2],[17,1,17,2],[12,3,13,5],[12,0,12,2],[22,1,22,2],[21,1,21,2],[18,1,18,2],[5,4,5,5],[6,4,6,5],[31,7,31,10],[32,1,32,2],[34,5,36,5],[67,1,67,2],[66,1,66,2],[64,1,64,2],[46,1,46,2],[48,1,48,2],[54,1,54,2],[51,1,51,2],[49,1,49,2],[52,1,52,2],[33,3,33,4],[37,3,37,4],[42,1,42,2],[40,1,40,2],[61,1,61,2],[57,1,57,2],[60,1,60,2],[43,1,43,2],[63,0,63,5],[65,1,65,2],[55,1,55,2],[47,1,47,2],[74,6,74,11],[56,1,56,2],[69,6,69,11],[75,0,75,5],[76,0,76,5],[62,1,62,2],[65,5,68,5],[34,1,34,2],[35,1,35,2],[36,1,36,2],[70,0,70,5],[68,1,68,2],[73,1,73,5],[71,0,71,5],[44,1,44,2],[45,1,45,2],[53,1,53,2],[41,1,41,2],[38,1,38,2]]}
[{"$f":"IF(G2=\"ADMINISTRATIVE REVIEW\",\"OFFICE OF ADMINISTRATIVE HEARINGS: CHILD SUPPORT\" & (CHAR(10)) & \"DEPARTMENT OF HUMAN SERVICES\",G1)","v":"OFFICE OF ADMINISTRATIVE HEARINGS: CHILD SUPPORT\nDEPARTMENT OF HUMAN SERVICES"},null,null,null,null,null,{"$f":"IF('Legal Styling'!B3=\"\",\"\",IF('Legal Styling'!B3=\" \",\"\",\"IN THE DISTRICT COURT OF \" & 'Legal Styling'!B3 & \" COUNTY\"))","v":"IN THE DISTRICT COURT OF Administrative Review COUNTY"}]
["STATE OF OKLAHOMA",null,null,null,null,null,{"$f":"'Legal Styling'!B3","v":"Administrative Review"}]
[null,null,null,null," "]
[{"$f":"'Legal Styling'!B4","v":" "},null,"    )    Dist. Ct. Case No.",null,{"$f":"'Legal Styling'!B9","v":" "}]
[{"$f":"'Legal Styling'!B5","v":" "},null,"    )\n    )    OAH Case No.",null,{"$f":"'Legal Styling'!B10","v":" "},null,null,null," "," "]
[{"$f":"'Legal Styling'!B6","v":" "},null,"    )\n    )                   FGN:",null,{"$f":"'Legal Styling'!B11","v":" "},null,null,null," "," "]
[{"$f":"'Legal Styling'!B7","v":" "},null,"    )\n    )    ",null,"",null,null,null," "]
[{"$f":"'Legal Styling'!B8","v":" "},null,"    )\n    )    ",null,null,null,null,null," "]
["CHILD SUPPORT COMPUTATION"]
[null,null,"Father","Father",""]
[null,null,"Mother","Mother",""]
[null,null,null," ",""]
[null,null,null,{"$f":"IF(ISERROR(C14*1),\"\",IF(C14>6,\"Number of children exceeds\" & (CHAR(10)) & \"Child Support Guideline Schedule.\" & (CHAR(10)) & \"See 43 O.S. § 119 (C).\",\"\"))","v":""},null,null,null," "]
[null,"Calculation for number of children in this case",{"$f":"'Child Support Comp Entry'!B4","v":0}]
[null,"Obligor (person who pays) is\n(Enter \"Father\" or \"Mother\")",{"$f":"IF(C38=\"Father\",\"Father\",IF(C38=\"Mother\",\"Mother\",\"\"))","v":""},{"$f":"IF(F28>15000,\"Combined income on Line 3 exceeds\" & (CHAR(10)) & \"Child Support Guideline Schedule.\" & (CHAR(10)) & \"See 43 O.S. § 119 (B).\",\"\")","v":""},null,null," "," "," "]
[null,null,null,null,null,null,null," "]
["A","Base monthly obligation",null,"Father","Mother","Combined"]
[1,"Gross monthly income\nAll sources, except income specifically excluded by 43 O.S. Section 118B(B)",null,{"$f":"'Child Support Comp Entry'!C5","v":0},{"$f":"'Child Support Comp Entry'!D5","v":0},{"$f":"(SUM(D18:E18))","v":0},null,null," "]
[null,"     a. Amount of self-employment income included in Line 1 ",null,{"$f":"'Child Support Comp Entry'!C6","v":0},{"$f":"'Child Support Comp Entry'!D6","v":0},null," ",null," "]
[null,"     b. Deduction for self-employment tax\n         Multiply Line 1a by 7.65% ",null,{"$f":"IF(ISERROR(D19*0.0765),0,ROUND(D19*0.0765,2))","v":0},{"$f":"IF(ISERROR(E19*0.0765),0,ROUND(E19*0.0765,2))","v":0}]
{"$rows_left_out":103}
{"sheet":"Insurance Premium Calculator","index":5,"n_rows":10,"n_cols":11,"rows_kept":10,"cut":false,"hidden":false,"merged":[[0,0,0,3],[0,8,0,11]]}
[" \n                                 INSURANCE PREMIUM WORKSHEET\nUse this form to compute the actual monthly premium for the children in the case.\n“Accessible” means there are available providers to meet the primary individual health care needs of the child(ren) no more than sixty (60) miles one way from the primary residence of the child(ren).  You may not wish to use the insurance premium amount if the coverage does not meet this standard.\n\nThis sheet is optional.  Use the Tab key to navigate to the entry fields.  Entry fields will have instructions on what to enter.",null,null,null,null,null,null,null," \n                                 INSURANCE PREMIUM WORKSHEET\nUse this form to compute the actual monthly premium for the children in the case.\n“Accessible” means there are available providers to meet the primary individual health care needs of the child(ren) no more than sixty (60) miles one way from the primary residence of the child(ren).  You may not wish to use the insurance premium amount if the coverage does not meet this standard.\n\nThis sheet is optional.  Use the Tab key to navigate to the entry fields.  Entry fields will have instructions on what to enter."]
["Info for calculation","Father","Mother","Other Custodian"]
["Enter the actual monthly health insurance premium cost paid by parent or other custodian for the adults and child(ren) in the household.",0,0,0]
["Enter cost of insurance for adults only ",0,0,0]
["Enter the number of dependent \nchildren being covered.  This \nincludes children on this case\nand other children covered on\nthe health insurance. ",0,0,0]
["Premium cost per child",{"$f":"'Insurance Premium'!D7","v":0},{"$f":"'Insurance Premium'!E7","v":0},{"$f":"'Insurance Premium'!F7","v":0},null,null,null,null,{"$f":"'Insurance Premium'!D7","v":0},{"$f":"'Insurance Premium'!E7","v":0},{"$f":"'Insurance Premium'!F7","v":0}]
["Enter the number of children on this order.  ",0,0,0]
["Monthly health insurance premium cost result",{"$f":"'Insurance Premium'!D9","v":0},{"$f":"'Insurance Premium'!E9","v":0},{"$f":"'Insurance Premium'!F9","v":0}," "," ",null,null,{"$f":"'Insurance Premium'!D9","v":0},{"$f":"'Insurance Premium'!E9","v":0},{"$f":"'Insurance Premium'!F9","v":0}]
["Monthly health insurance share for each parent",{"$f":"'Insurance Premium'!D10","v":0},{"$f":"'Insurance Premium'!E10","v":0},null," ",null,null,null,{"$f":"'Insurance Premium'!D10","v":0},{"$f":"'Insurance Premium'!E10","v":0}]
["5% of Gross Monthly Income \nmultiplied by 0.05 \nThis represents the maximum amount of total medical allowed.\n      Note:  Health insurance should\n      be reasonable in cost which \n      means the share of premium \n      for the parent\n      providing the coverage does not \n      exceed 5% of gross monthly \n      income.  If the share of premium for\n      the parent is greater \n      than 5% of gross monthly income, \n      parents may agree\n      to use premium cost \n      or must proceed to Section H. \n      Cash Medical Support. \n      If more than one parent has\n      insurance available, the court shall\n      give priority to the preference of the\n      custodial person unless not in best \n      interest of the child(ren).",{"$f":"'Insurance Premium'!D11","v":0},{"$f":"'Insurance Premium'!E11","v":0},null," ",null,null,null,{"$f":"'Insurance Premium'!D11","v":0},{"$f":"'Insurance Premium'!E11","v":0}]

{"sheet":"CS Schedule","index":6,"n_rows":298,"n_cols":8,"rows_kept":298,"cut":false,"hidden":true,"merged":[]}
["Eff. June 6, 2000",null,null,null,null,null,null,"43 O.S. § 119 "]
[null,null,null,null,"OKLAHOMA"]
[]
[null,null,null,null,"SCHEDULE OF BASIC CHILD SUPPORT OBLIGATIONS"]
["COMBINED"]
["GROSS"]
["MONTHLY",null,"ONE","TWO","THREE","FOUR","FIVE","SIX"]
["INCOME",null,"CHILD","CHILDREN","CHILDREN","CHILDREN","CHILDREN","CHILDREN"]
[0,null,50,50,50,50,50,50]
[600,null,50,50,50,50,50,50]
[650,null,50,50,50,88,118,141.37488333333329]
[700,null,50,50,101.30641333333337,122,154,175.85988333333336]
[750,null,61.147499999999944,107.32691666666662,131.50633333333329,156.18574999999996,198,207.04458333333326]
[800,null,94.042500000000004,140.58741666666668,165.13233333333335,190.17725000000002,239.22216666666665,241.76708333333332]
[850,null,126.9375,173.84791666666663,198.7583333333333,224.16874999999999,273.57916666666659,276.48958333333326]
[900,null,159.4725,206.74441666666672,232.01633333333339,257.78825000000006,307.5601666666667,310.83208333333334]
[950,null,191.98500000000001,239.61816666666661,265.25133333333326,291.38449999999995,341.51766666666657,345.15083333333325]
[1000,null,206.34898287116664,272.49191666666661,298.48633333333328,324.98074999999994,375.47516666666661,379.46958333333328]
[1050,null,215.02032118199998,305.36566666666664,331.72133333333329,358.57699999999994,409.43266666666659,413.78833333333324]
[1100,null,223.64765270094443,326.1057205956111,364.78766666666667,392.00274999999999,443.21783333333332,447.93291666666664]
{"$rows_left_out":279}
{"sheet":"Insurance Premium","index":7,"n_rows":11,"n_cols":9,"rows_kept":11,"cut":false,"hidden":true,"merged":[[9,5,10,5],[9,1,9,2],[10,1,10,2],[6,1,6,2],[7,1,7,2],[0,0,0,5],[4,1,4,2],[5,1,5,2],[8,1,8,2],[1,0,1,5],[2,1,2,2],[3,1,3,2]]}
["Insurance Premium WorksheetA1:F11"]
["Use this form to compute the actual monthly premium for the children in the case.\n“Accessible” means there are available providers to meet the primary individual health care needs of the child(ren) no more than sixty (60) miles one way from the primary residence of the child(ren).  You may not wish to use the insurance premium amount if the coverage does not meet this standard."]
[" "," ",null,"Father","Mother","Other Custodian"]
[null,"  11a. The actual monthly health\n         premium cost paid by parent or \n         other custodian for the adults\n         and child(ren) in the household. ",null,{"$f":"'Insurance Premium Calculator'!B3","v":0},{"$f":"'Insurance Premium Calculator'!C3","v":0},{"$f":"'Insurance Premium Calculator'!D3","v":0}]
[null,"  11b. Cost of insurance for adults only ",null,{"$f":"'Insurance Premium Calculator'!B4","v":0},{"$f":"'Insurance Premium Calculator'!C4","v":0},{"$f":"'Insurance Premium Calculator'!D4","v":0}]
[null,"  11c. The number of dependent \n         children being covered. This \n         includes children on this case\n         and other children covered on\n         the health insurance. ",null,{"$f":"'Insurance Premium Calculator'!B5","v":0},{"$f":"'Insurance Premium Calculator'!C5","v":0},{"$f":"'Insurance Premium Calculator'!D5","v":0}]
[null,"  11d. Premium cost per child\n         Line a minus b, divided by\n         Line c  ",null,{"$f":"IF(ISNUMBER(D6),IF(D6>0,ROUND((D4-D5)/D6,2),0),0)","v":0},{"$f":"IF(ISNUMBER(E6),IF(E6>0,ROUND((E4-E5)/E6,2),0),0)","v":0},{"$f":"IF(ISNUMBER(F6),IF(F6>0,ROUND((F4-F5)/F6,2),0),0)","v":0}]
[null,"  11e. The number of children on\n         this order.  ",null,{"$f":"'Insurance Premium Calculator'!B7","v":0},{"$f":"'Insurance Premium Calculator'!C7","v":0},{"$f":"'Insurance Premium Calculator'!D7","v":0}]
[11,"Monthly health insurance premium costs\nLine 11d multiplied by Line 11e",null,{"$f":"IF(ISNUMBER(D8),IF(D8>0,D8*D7,'Child Support Computation'!D44),'Child Support Computation'!D44)","v":0},{"$f":"IF(ISNUMBER(E8),IF(E8>0,E8*E7,'Child Support Computation'!E44),'Child Support Computation'!E44)","v":0},{"$f":"IF(ISNUMBER(F8),IF(F8>0,F8*F7,'Child Support Computation'!F44),'Child Support Computation'!F44)","v":0},null,{"$f":"SUM(D9:F9)","v":0}," "]
[12,"Monthly health insurance share for each parent\nPercentage share of income in Line 4 multiplied by total current insurance cost for all persons in Line 11",null,{"$f":"IF(ISERROR('Child Support Computation'!D29*$H9),0,ROUND('Child Support Computation'!D29*$H9,2))","v":0},{"$f":"IF(ISERROR('Child Support Computation'!E29*$H9),0,ROUND('Child Support Computation'!E29*$H9,2))","v":0},null," "," "]
[22,"5% of Gross Monthly Income \nLine 2 of Comp. Form multiplied by 0.05 \nThis represents the maximum amount of total medical allowed.\n      Note:  Health insurance should\n      be reasonable in cost which \n      means the share of premium \n      shown on Line 12 for the parent\n      providing the coverage does not \n      exceed 5% of gross monthly \n      income.  If Line 12 is greater \n      than Line 22, parents may \n      agree to use premium cost \n      or must proceed to Section H. \n      Cash Medical Support. \n      If more than one parent has\n      insurance available, the court shall\n      give priority to the preference of the\n      custodial person unless not in best \n      interest of the child(ren).",null,{"$f":"'Child Support Computation'!D21*0.05","v":0},{"$f":"'Child Support Computation'!E21*0.05","v":0},null," "," "]

{"sheet":"Cash Medical Table","index":8,"n_rows":13,"n_cols":9,"rows_kept":13,"cut":false,"hidden":false,"merged":[[4,9,4,19],[5,7,6,7],[5,8,6,8],[10,8,11,8],[10,4,11,4],[10,5,11,5],[10,6,11,6],[10,7,11,7],[1,3,1,5],[5,4,6,4],[5,5,6,5],[5,6,6,6],[4,0,4,8],[5,1,6,1],[3,1,3,7],[5,0,6,0],[5,2,6,2],[5,3,6,3],[10,0,11,0],[10,1,11,1],[10,2,11,2],[10,3,11,3],[9,0,9,8]]}
[]
[null,null,null," "]
[]
[null,"OKLAHOMA CASH MEDICAL INCOME GUIDELINES TABLE "]
["             OKLAHOMA CASH MEDICAL INCOME GUIDELINES TABLE         Eff. March 1, 2023\nThe following table reflects 185% of the Federal Poverty Guidelines as of January, 2023.  If the Obligor's income as shown on the Child Support Computation and the total number of children in the case is at or below the amounts on the table, cash medical support will be established at $0.00.  If the Obligor's income exceeds the amount listed on the table for the number of children, the cash medical support obligation will be $115.00 per child for the children not covered by health insurance, pro rated by the income of the parents.  The obligor's share of the cash medical order should not exceed 5% of the gross income of the obligor.  "]
["Number of\nchildren",1,2,3,4,5,6,7,"8 or more"]
[]
["Income\nof the\nObligor",3040,3833,4625,5417,6210,7002,7795,"For each child over 7, add $792 per child"]
[]
["             OKLAHOMA CASH MEDICAL INCOME GUIDELINES TABLE        Eff. Sept 15, 2015\nThe following table reflects 185% of the Federal Poverty Guidelines as of April 1, 2009.  If the combined income of the parents as shown on the Child Support Computation and the total number of children in the case being considered is at or below the amounts on the table, cash medical support will be established at $0.00.  If the combined income exceeds the amount listed on the table for the number of children, the cash medical support obligation will be $115.00 per child for the children not covered by health insurance, pro rated by the income of the parents.  The obligor's share of the cash medical order should not exceed 5% of the gross income of the obligor.  "]
["Number of\nchildren",1,2,3,4,5,6,7,"8 or more"]
[]
["Income\nof the\nObligor",2425,3051,3677,4303,4929,5555,6181,"For each child over 7, add $626 per month"]

{"sheet":"RSO","index":9,"n_rows":1,"n_cols":2,"rows_kept":1,"cut":false,"hidden":true,"merged":[]}
["Current support should be set at $ ______per month plus cash medical in the amount of $_____ per month making a total monthly amount of $______. Deviation should be granted in the best interest of the children who are impacted by this order, allowing for equitable allocation of funds available for support of all __ children in __ cases. Child support amount was calculated by a child support guidelines which uses the non-custodial parent's gross monthly income and the average of __ biological parents’ gross monthly income (plus daycare and or/ private medical costs if applicable) and the total number of children in these cases for an equitable distribution for all children involved in these proceedings.","                                                                                              _____________________________________________________________________________________________\n                                                              _____________________________________________________________________________________________ \n                                                                          _____________________________________________________________________________________________"]

{"sheet":"Storage","index":10,"n_rows":7,"n_cols":6,"rows_kept":7,"cut":false,"hidden":true,"merged":[]}
["continue"]
[{"$f":"'Child Support Computation'!C15","v":""}]
[{"$f":"'Child Support Computation'!D32","v":0},{"$f":"'Child Support Computation'!E32","v":365}]
[{"$f":"IF(SUM(A3)<0,0,SUM(A3))","v":0},{"$f":"IF(SUM(B3)<0,0,SUM(B3))","v":365}]
[{"$f":"IF(A2=\"father\",A4,IF(A2=\"mother\",B4,0))","v":0}]
[]
[null,null,null,null,null,"                                                                                              _____________________________________________________________________________________________\n                                                              _____________________________________________________________________________________________ \n                                                                          _____________________________________________________________________________________________"]

{"sheet":"Sheet1","index":11,"n_rows":0,"n_cols":0,"rows_kept":0,"cut":false,"hidden":true,"merged":[]}

{"sheet":"Sheet2","index":12,"n_rows":0,"n_cols":0,"rows_kept":0,"cut":false,"hidden":true,"merged":[]}